<?xml version="1.0" standalone="no"?>
<!DOCTYPE svg PUBLIC "-//W3C//DTD SVG 20010904//EN"
 "http://www.w3.org/TR/2001/REC-SVG-20010904/DTD/svg10.dtd">
<svg version="1.0" xmlns="http://www.w3.org/2000/svg"
 width="1100.000000pt" height="1100.000000pt" viewBox="0 0 1100.000000 1100.000000"
 preserveAspectRatio="xMidYMid meet">
<metadata>
Created by potrace 1.14, written by Peter Selinger 2001-2017
</metadata>
<g transform="translate(0.000000,1100.000000) scale(0.100000,-0.100000)"
fill="#000000" stroke="none">
<path d="M594 10340 c-14 -5 -14 -8 1 -20 25 -21 87 -116 124 -188 59 -116
109 -291 128 -443 9 -72 8 -5238 -1 -5419 -5 -108 -9 -144 -21 -196 -3 -12 -7
-38 -11 -59 -19 -120 -107 -322 -187 -431 l-45 -61 780 0 779 0 -24 26 c-69
75 -155 241 -193 372 -32 113 -41 158 -60 299 -7 54 -14 3948 -7 3962 3 6 458
-373 483 -401 3 -3 43 -40 90 -81 47 -41 90 -79 96 -85 6 -5 44 -39 84 -75 99
-87 105 -92 211 -190 119 -109 316 -306 396 -395 58 -66 73 -83 116 -134 119
-144 248 -360 295 -496 42 -122 53 -184 52 -294 -1 -133 -22 -220 -80 -328
-22 -40 -36 -74 -32 -74 30 -6 892 -3 892 3 0 4 -9 22 -20 41 -59 100 -90 235
-86 372 12 356 279 696 1056 1345 222 185 296 247 322 273 78 74 529 430 669
526 187 130 388 314 518 476 149 185 275 411 346 618 20 59 38 115 40 125 2 9
8 38 14 64 6 25 13 70 16 100 16 152 28 226 50 310 14 51 27 101 29 111 12 46
108 228 150 285 36 49 42 62 28 63 -55 3 -1532 3 -1532 1 0 -2 19 -29 43 -60
40 -55 48 -67 86 -136 38 -69 85 -210 98 -296 9 -58 9 -230 0 -295 -19 -147
-98 -332 -198 -465 -71 -94 -310 -340 -464 -476 -55 -49 -102 -91 -105 -94 -3
-3 -23 -20 -45 -39 -33 -28 -187 -167 -229 -206 -52 -49 -217 -170 -565 -415
-237 -167 -386 -286 -488 -391 -75 -76 -148 -167 -166 -206 -9 -21 -13 -16
-53 53 -81 142 -233 308 -459 503 -55 47 -102 88 -105 91 -3 3 -18 16 -35 29
-16 12 -48 38 -70 56 -22 18 -112 93 -200 165 -87 73 -181 153 -208 179 -28
25 -55 51 -61 56 -6 6 -76 69 -156 140 -564 506 -719 713 -768 1025 -9 58 -9
262 0 318 25 147 140 386 217 450 13 10 12 12 -5 13 -99 4 -1519 3 -1530 -1z"/>
<path d="M7921 9996 c-58 -57 -137 -134 -176 -171 -270 -259 -335 -328 -335
-355 0 -20 37 -72 141 -201 78 -96 153 -189 168 -207 14 -19 62 -78 106 -131
44 -54 152 -187 240 -296 88 -109 165 -203 170 -209 6 -6 57 -69 115 -141 58
-71 110 -137 117 -145 7 -8 105 -130 219 -270 246 -305 244 -302 280 -302 34
0 54 21 260 277 49 61 96 119 106 130 16 19 313 384 717 880 107 132 198 242
201 245 3 3 21 25 40 50 19 25 37 47 40 50 17 16 179 219 188 237 7 12 12 30
12 41 0 11 -110 126 -289 300 -158 155 -300 291 -314 302 -25 20 -41 20 -963
20 l-937 0 -106 -104z m889 -37 c0 -3 -12 -19 -27 -35 -15 -16 -77 -82 -137
-148 -61 -65 -127 -136 -146 -158 l-36 -41 -71 99 c-148 203 -201 279 -198
284 4 7 615 6 615 -1z m930 1 c0 -5 -120 -162 -266 -348 -14 -18 -30 -32 -35
-30 -13 4 -328 372 -324 378 4 7 625 7 625 0z m-1545 -239 c69 -96 122 -177
119 -180 -3 -3 -156 -6 -340 -6 l-335 0 203 197 c181 176 204 195 215 180 8
-9 70 -95 138 -191z m1980 -65 c66 -64 116 -116 110 -117 -22 -3 -695 -4 -695
-1 0 4 143 191 233 305 l70 89 81 -80 c45 -44 135 -133 201 -196z m-1120 159
c33 -38 62 -72 65 -75 3 -3 30 -34 60 -70 30 -35 66 -77 78 -92 13 -14 22 -30
20 -35 -1 -4 -152 -8 -335 -8 -248 0 -330 3 -325 11 4 7 36 43 72 81 36 38
112 119 169 181 98 105 106 111 120 95 9 -10 43 -49 76 -88z m-651 -416 c2 -2
36 -121 76 -264 66 -241 87 -318 125 -450 8 -27 55 -198 105 -380 50 -181 95
-341 101 -355 l10 -25 -24 25 c-14 14 -181 219 -373 455 -192 237 -451 556
-576 710 -125 154 -223 282 -218 285 9 6 768 5 774 -1z m943 -2 c6 -4 -1 -45
-19 -114 -15 -59 -56 -214 -89 -343 -126 -482 -178 -678 -209 -795 -17 -66
-33 -127 -35 -135 -13 -59 -28 -110 -31 -107 -5 4 -47 152 -124 432 -28 105
-70 253 -91 330 -22 77 -44 156 -49 175 -14 52 -62 225 -111 398 -28 103 -39
156 -32 160 14 9 776 7 790 -1z m956 4 c13 -1 -12 -38 -95 -140 -62 -76 -180
-221 -262 -322 -82 -101 -152 -186 -155 -189 -3 -3 -42 -50 -86 -105 -44 -55
-82 -102 -85 -105 -10 -9 -174 -211 -190 -234 -8 -11 -22 -28 -30 -36 -9 -8
-31 -35 -50 -60 -19 -25 -37 -47 -40 -50 -3 -3 -46 -54 -94 -115 -49 -60 -93
-114 -97 -119 -9 -10 -7 1 11 69 6 22 12 48 15 57 2 10 18 71 35 135 27 100
124 476 136 523 2 8 11 42 20 75 9 33 18 67 19 75 29 126 140 528 150 535 9 8
664 13 798 6z"/>
<path d="M7257 8194 c-20 -102 -95 -223 -205 -331 -156 -153 -376 -291 -652
-408 -63 -27 -117 -50 -120 -53 -3 -2 -6 -688 -7 -1525 -5 -3137 -10 -4603
-16 -4632 -3 -16 -9 -50 -12 -75 -16 -118 -67 -284 -116 -382 -37 -73 -94
-163 -121 -190 -11 -11 -17 -22 -14 -25 4 -4 1226 -7 1508 -4 l58 1 -44 58
c-78 100 -145 246 -186 402 -36 135 -47 269 -49 607 l-2 321 118 97 c65 53
136 111 158 130 22 18 207 169 410 335 204 166 379 309 390 318 11 10 144 118
295 242 311 254 279 228 425 351 280 236 644 601 781 785 16 21 34 44 40 49
46 41 236 338 307 481 93 185 174 417 201 579 33 194 40 283 40 475 0 226 -13
351 -54 515 -56 225 -138 386 -273 540 -151 173 -344 294 -602 380 -100 33
-193 59 -250 69 -16 3 -41 8 -55 11 -26 6 -183 29 -260 39 -25 4 -83 9 -130
12 -47 3 -103 8 -125 10 -29 4 -1027 13 -1402 14 l-23 0 -2 423 c-2 254 -6
406 -11 381z m1361 -1697 c13 -3 51 -9 85 -12 34 -4 64 -8 68 -10 3 -2 19 -6
35 -9 217 -39 406 -154 509 -309 92 -139 130 -291 130 -527 0 -288 -36 -447
-160 -705 -121 -253 -285 -469 -554 -729 -108 -104 -107 -103 -171 -156 -30
-25 -59 -50 -65 -56 -5 -6 -41 -35 -80 -65 -38 -29 -75 -58 -81 -64 -24 -22
-65 -55 -229 -185 -94 -74 -172 -137 -175 -140 -3 -3 -50 -41 -105 -86 -191
-153 -520 -417 -532 -427 -10 -8 -13 343 -13 1743 l0 1752 658 -5 c361 -2 667
-7 680 -10z"/>
<path d="M3928 3015 c-2 -2 -25 -6 -51 -9 -106 -14 -248 -86 -314 -159 -87
-96 -135 -222 -133 -352 1 -84 2 -88 16 -146 29 -117 95 -232 209 -362 37 -43
66 -79 64 -80 -2 -1 -22 -11 -44 -22 -187 -93 -337 -266 -402 -464 -24 -73
-26 -272 -2 -357 47 -174 152 -301 313 -379 121 -59 208 -78 371 -79 123 -1
151 2 235 23 156 39 335 159 428 286 l22 30 76 -80 c81 -85 108 -128 119 -188
l7 -37 250 0 251 0 -89 62 c-93 66 -251 217 -395 377 -46 52 -90 100 -97 108
-13 13 -12 49 4 113 3 14 7 198 8 410 3 423 6 449 66 543 16 26 30 49 30 50 0
1 -105 2 -234 2 -153 0 -232 -3 -228 -10 3 -5 13 -21 22 -35 18 -25 44 -94 56
-147 4 -15 8 -163 10 -328 l3 -300 -52 56 c-59 62 -196 213 -224 245 -27 32
-180 200 -247 271 -75 80 -143 168 -166 213 -45 90 -50 207 -12 292 42 96 129
142 267 142 106 -1 183 -34 255 -110 50 -52 50 -53 64 -31 8 12 44 71 81 132
l67 109 -54 51 c-109 102 -254 154 -440 160 -58 2 -108 2 -110 0z m40 -1364
c99 -102 354 -371 419 -440 35 -36 63 -71 63 -77 0 -34 -96 -133 -172 -178
-90 -52 -161 -70 -278 -70 -91 1 -130 8 -196 38 -234 107 -254 471 -37 677 33
32 132 108 141 109 2 0 29 -27 60 -59z"/>
</g>
</svg>
