@startuml
skinparam style strictuml


class MonopolyApplication{
  main()
}

Class Score{
  amountOfMoney:float
  valueOfOwnedProperties : float[]
  /totalWealth:float
  playerName:String
  trace:String[]
  turnDurations : float[]
  endDate:Date
}

Class Game{
  startDate
  endDate
}

Class Round{}

Class Player{
 name
 money
}

Class Action{}

Class Turn{
  startDateTime
  endDateTime
  /duration
}

Class Board{}

' 2 Dice in a Cup
Class Cup{}


Class Pawn{
 /position
}

Class Property{
 color:StreetColor
 housing:Housing
 /rent
 price
}

enum StreetColor{
  Green
  Dark Blue
  Light Blue
  Red Set
  Yellow
  Orange
  Brown
  Purple
}
enum Housing{
  0: "No housing"
  1: "1 House"
  2: "2 Houses"
  3: "3 Houses"
  4: "4 Houses"
  5: "Hotel"
}

' Generalisation of a property
Class Square{
 name
 position
}

' specialisation of Property
Class Lot{}
Class Railroad{}
Class Utility{}

' other special(isation) Square
Class Go{}
Class IncomeTax{}

MonopolyApplication "1" -d- "*" Game : plays >
Game "1" -l- "1" Cup : played with >
Cup "1" -l- "2" Die : holds >
Game "1" -r- "1" Board : played on >
Game "1" -u- "*" Round
Round "1" -l- "0..8" Turn
Turn "1" -l- "1..*" Action
Board "1" -d- "40" Square : consists of >
Player "2..8" -u- Game : plays >
Player "1" -d- "1" Score : scores >
Player "1" -r- "1" Pawn : plays with >
Pawn "0..8" -r- "1" Square: landed on >
Player "0..1" -d- "*" Property : owns >
Lot -u-|> Property
Railroad -u-|> Property
Utility -u-|> Property
Property -u-|> Square

Go -u-|> Square
IncomeTax -u-|> Square
@enduml