{
  "font_family": "Hershey-Noailles-symbolic",
  "font_size": 30,
  "glyphs": ["f", "e", "i", "d"],
  "color_pick": ["#000000"],
  "colors_glyphs": [
    "blue", "green","blue", "coral", "yellow",
    "blue", "green","blue", "coral", "yellow",
    "blue", "green","darkblue", "coral", "yellow"
  
  ],
  "frequency": [1, 10],
  "rotate": 45,
  "var_rotate": [0, 0],
  "translate_x": 0,
  "increment_transx": 0,
  "translate_y": 30,
  "increment_transy": 0,
  "scan": ["all"]
}

