﻿artistas,nota
Eminem,29
Imagine_Dragons,25
Red_Hot_Chili_Peppers,22
Ed_Sheeran,20
Queen_(band),20
Alt-J,15
Avenged_Sevenfold,14
Metallica,14
AC/DC,13
Arctic_Monkeys,13
Foo_Fighters,13
Linkin_Park,13
Green_Day,12
Radiohead,12
The_Killers,12
Beyoncé,10
Charlie_Brown_Jr.,10
Exaltasamba,10
Five_Finger_Death_Punch,10
Guns_N%27_Roses,10
Lady_Gaga,10
Panic!_at_the_Disco,10
The_Strokes,10
Tupac_Shakur,10
Drake_(musician),9
Jay-Z,9
Nirvana,9
Post_Malone,9
Skillet_(band),9
The_Doors,9
XXXTentacion,9
Beyonc%C3%A9,8
David_Bowie,8
Two_Door_Cinema_Club,8
MGMT,7
Alok_(DJ),6
6lack,5
Above_%26_Beyond_(group),5
Accept_(band),5
Adele,5
Adriana_Calcanhotto,5
Aimer,5
Alligatoah,5
American_Pleasure_Club,5
Anamanaguchi,5
AnnenMayKantereit,5
AOA_(band),5
Arcade_Fire,5
Barbra_Streisand,5
Big_Pun,5
Bob_Marley,5
Caravan_Palace,5
Cartola,5
Chris_Brown,5
Cocteau_Twins,5
Crystal_Castles,5
Dennis_Lloyd,5
Disturbed_(band),5
Donald_Glover,5
Dr._Dre,5
Eazy-E,5
Eluveitie,5
Fiddler%27s_Green,5
Flogging_Molly,5
Flow_(Japanese_band),5
Frank_Ocean,5
Garnidelia,5
Gloria_Groove,5
Gorillaz,5
Grimes_(musician),5
Have_a_Nice_Life,5
Heidevolk,5
Hilltop_Hoods,5
Hiroyuki_Sawano,5
Iron_Maiden,5
Joji_(musician),5
Kanye_West,5
Kendrick_Lamar,5
Khalid,5
Korpiklaani,5
Lacuna_Coil,5
Lauryn_Hill,5
Led_Zeppelin,5
Less_Than_Jake,5
"LiSA_(Japanese_musician,_born_1987)",5
Los_Hermanos,5
Luan_Santana,5
Ludwig_van_Beethoven,5
Luke_Bryan,5
Luniz,5
Man_with_a_Mission,5
Mariah_Carey,5
Marina_and_the_Diamonds,5
Michael_Jackson,5
Miku_Sawai,5
Mobb_Deep,5
Mumford_%26_Sons,5
Muse_(band),5
Nano_(singer),5
Newsboys,5
O_Rappa,5
One_Ok_Rock,5
Oomph!,5
Paramore,5
Pearl_Jam,5
Pink_Floyd,5
Puffy_AmiYumi,5
Rainbow_(group),5
Ramones,5
Revolverheld,5
Rhapsody_of_Fire,5
Rihanna,5
S%C3%B3lstafir,5
Saint_Motel,5
Sam_Smith_(singer),5
Scandal_(Japanese_band),5
SDP_(band),5
Seth_Sentry,5
Smashing_pumpkins,5
Sonata_Arctica,5
Suicideboys,5
Talking_Heads,5
Taylor_Davis_(violinist),5
Terra_Celta,5
The_Lumineers,5
The_National_(band),5
The_Neighbourhood,5
The_Notorious_B.I.G.,5
Thundamentals,5
Tinashe,5
Van_Canto,5
Volbeat,5
Young_the_Giant,5
6ix9ine,4
Aerosmith,4
Alan_Walker_(music_producer),4
Anitta_(singer),4
Audioslave,4
Back-On,4
Blackpink,4
Bring_Me_the_Horizon,4
BTS_(band),4
Chet_Faker,4
ClariS,4
Clean_Bandit,4
Coldplay,4
Dire_Straits,4
Do_As_Infinity,4
Elis_Regina,4
Escape_the_Fate,4
Foster_the_People,4
Fugees,4
J._Cole,4
Jaden_Smith,4
Kamasi_Washington,4
Katy_Perry,4
Legi%C3%A3o_Urbana,4
Lewis_Del_Mar,4
Lil_Pump,4
Lorde,4
Madonna_(entertainer),4
Maroon_5,4
Marshmello,4
Nightwish,4
Nirvana_(band),4
Nujabes,4
Of_Monsters_and_Men,4
Parov_Stelar,4
Perfume_(Japanese_band),4
Pyotr_Ilyich_Tchaikovsky,4
Racionais_MC%27s,4
Rammstein,4
Rancid_(band),4
Ratatat,4
Reol_(band),4
Ringo_Deathstarr,4
Rita_Lee,4
Sabaton_(band),4
Sayuri,4
Shinedown,4
Sticky_Fingers,4
Stromae,4
Sum_41,4
The_Who,4
Twenty_One_Pilots,4
Two_Steps_from_Hell,4
Uverworld,4
Vintage_Culture,4
Whitney_Houston,4
Wintersun,4
Yanni,4
Yes_(band),4
Zaz_(singer),4
Armin_van_Buuren,3
Blur_(band),3
Bon_Jovi,3
Cage_the_Elephant,3
Colbie_Caillat,3
David_Guetta,3
Dragon_Force,3
Glass_Animals,3
Hollywood_Undead,3
Kings_of_Leon,3
Lauren_Daigle,3
Lil_Wayne,3
Martin_Garrix,3
Milky_Chance,3
Of_Montreal,3
Oh_Wonder,3
Os_Paralamas_do_Sucesso,3
Seafret,3
Sean_Combs,3
Seether,3
Selena_Gomez,3
Shakira,3
Skrillex,3
Tears_for_Fears,3
Ti%C3%ABsto,3
Vince_Staples,3
Iggy_Pop,2
Steve_Aoki,2
The_Offspring,2
Madonna,1
MC_Guim%C3%AA,1
