{
	"info": {
		"_postman_id": "89aa9fde-10f1-4070-83ee-0a61d89849eb",
		"name": "s25",
		"schema": "https://schema.getpostman.com/json/collection/v2.1.0/collection.json"
	},
	"item": [
		{
			"name": "discussion",
			"item": [
				{
					"name": "users",
					"item": [
						{
							"name": "admin",
							"request": {
								"method": "GET",
								"header": [],
								"url": {
									"raw": "http://localhost:4000/admin",
									"protocol": "http",
									"host": [
										"localhost"
									],
									"port": "4000",
									"path": [
										"admin"
									]
								}
							},
							"response": []
						},
						{
							"name": "register",
							"request": {
								"method": "POST",
								"header": [],
								"body": {
									"mode": "raw",
									"raw": "{\r\n    \"email\":\"jaundelacruz@email.com\",\r\n    \"password\": \"password12356\",\r\n    \"mobileNo\":\"0978123456\",\r\n    \"birthdate\": \"01/07/1992\",\r\n    \"gender\": \"male\"\r\n}",
									"options": {
										"raw": {
											"language": "json"
										}
									}
								},
								"url": {
									"raw": "http://localhost:4000/register",
									"protocol": "http",
									"host": [
										"localhost"
									],
									"port": "4000",
									"path": [
										"register"
									]
								}
							},
							"response": []
						},
						{
							"name": "home",
							"request": {
								"method": "GET",
								"header": [],
								"url": {
									"raw": "http://localhost:4000/",
									"protocol": "http",
									"host": [
										"localhost"
									],
									"port": "4000",
									"path": [
										""
									]
								}
							},
							"response": []
						}
					]
				},
				{
					"name": "products",
					"item": [
						{
							"name": "create",
							"request": {
								"method": "POST",
								"header": [],
								"body": {
									"mode": "raw",
									"raw": "{\r\n    \"name\": \"Fila\",\r\n    \"price\": \"980\",\r\n    \"stocks\": \"6\",\r\n    \"color\": \"blue\",\r\n    \"category\": \"footwear\"\r\n\r\n}",
									"options": {
										"raw": {
											"language": "json"
										}
									}
								},
								"url": {
									"raw": "http://localhost:4000/create",
									"protocol": "http",
									"host": [
										"localhost"
									],
									"port": "4000",
									"path": [
										"create"
									]
								}
							},
							"response": []
						},
						{
							"name": "products",
							"request": {
								"method": "GET",
								"header": [],
								"url": {
									"raw": "http://localhost:4000/catalog",
									"protocol": "http",
									"host": [
										"localhost"
									],
									"port": "4000",
									"path": [
										"catalog"
									]
								}
							},
							"response": []
						}
					]
				}
			]
		},
		{
			"name": "activity",
			"item": [
				{
					"name": "landing",
					"request": {
						"method": "GET",
						"header": [],
						"url": {
							"raw": "http://localhost:3000/landing",
							"protocol": "http",
							"host": [
								"localhost"
							],
							"port": "3000",
							"path": [
								"landing"
							]
						}
					},
					"response": []
				},
				{
					"name": "courses",
					"request": {
						"method": "GET",
						"header": [],
						"url": {
							"raw": "http://localhost:3000/courses",
							"protocol": "http",
							"host": [
								"localhost"
							],
							"port": "3000",
							"path": [
								"courses"
							]
						}
					},
					"response": []
				},
				{
					"name": "register",
					"request": {
						"method": "GET",
						"header": [],
						"url": {
							"raw": "http://localhost:3000/register",
							"protocol": "http",
							"host": [
								"localhost"
							],
							"port": "3000",
							"path": [
								"register"
							]
						}
					},
					"response": []
				},
				{
					"name": "create",
					"request": {
						"method": "GET",
						"header": [],
						"url": {
							"raw": "http://localhost:3000/create",
							"protocol": "http",
							"host": [
								"localhost"
							],
							"port": "3000",
							"path": [
								"create"
							]
						}
					},
					"response": []
				},
				{
					"name": "admin",
					"request": {
						"method": "GET",
						"header": [],
						"url": {
							"raw": "http://localhost:3000/admin",
							"protocol": "http",
							"host": [
								"localhost"
							],
							"port": "3000",
							"path": [
								"admin"
							]
						}
					},
					"response": []
				},
				{
					"name": "students",
					"request": {
						"method": "GET",
						"header": [],
						"url": {
							"raw": "http://localhost:3000/students",
							"protocol": "http",
							"host": [
								"localhost"
							],
							"port": "3000",
							"path": [
								"students"
							]
						}
					},
					"response": []
				}
			]
		}
	]
}