sp,VolNRDeliv_1,RankNRDeliv_1,TypeNRDeliv_1,VolNRDeliv_2,RankNRDeliv_2,TypeNRDeliv_2,VolNRDeliv_3,RankNRDeliv_3,TypeNRDeliv_3
1,-4000,1,0,0,1,0,1000,1,0
2,-4000,1,0,0,1,0,1000,1,0
3,-4000,1,0,0,1,0,1000,1,0
4,-4000,1,0,0,1,0,1000,1,0
5,-4000,1,0,0,1,0,1000,1,0
6,-4000,1,0,0,1,0,1000,1,0
7,-4000,1,0,0,1,0,1000,1,0
8,-4000,1,0,0,1,0,1000,1,0
9,-4000,1,0,0,1,0,1000,1,0
10,-4000,1,0,0,1,0,1000,1,0
11,-4000,1,0,0,1,0,1000,1,0
12,-4000,1,0,0,1,0,1000,1,0