{
    "series": [
      {
        "user": "Sales",
        "data": [30, 40, 45, 50, 49, 60, 70, 91, 125, 150, 180, 200]
      },
      {
        "user": "Boughts",
        "data": [10, 20, 30, 40, 50, 100]
      }
    ],
    "categories": [
      "Jan",
      "Feb",
      "Mar",
      "Apr",
      "May",
      "Jun",
      "Jul",
      "Aug",
      "Sep",
      "Oct",
      "Nov",
      "Dec"
    ]
  }