{
  "meta": {
    "version": "1.10",
    "at": 1674056706,
    "collected_dbs": [
      "emanuelcalvo"
    ],
    "local": true,
    "user_agent": "pgmetrics/devel"
  },
  "start_time": 1674052570,
  "system_identifier": "7063572035114936419",
  "checkpoint_lsn": "74/5869110",
  "prior_lsn": "",
  "redo_lsn": "74/58690D8",
  "timeline_id": 1,
  "next_xid": 52400640,
  "oldest_xid": 726,
  "oldest_active_xid": 52400640,
  "checkpoint_time": 1674056170,
  "wal_flush_lsn": "74/586BCC0",
  "wal_insert_lsn": "74/586BCC0",
  "wal_lsn": "74/586BCC0",
  "is_in_recovery": false,
  "is_wal_replay_paused": false,
  "last_wal_receive_lsn": "",
  "last_wal_replay_lsn": "",
  "last_xact_replay_timestamp": 0,
  "last_xact_xid": 0,
  "last_xact_time": 0,
  "wal_archiving": {
    "archived_count": 0,
    "last_archived_wal": "",
    "last_archived_time": 0,
    "failed_count": 0,
    "last_failed_wal": "",
    "last_failed_time": 0,
    "stats_reset": 1664442038
  },
  "wal_count": 63,
  "wal_ready_count": 0,
  "notification_queue_usage": 0,
  "bg_writer": {
    "checkpoints_timed": 1250,
    "checkpoints_req": 8,
    "checkpoint_write_time": 9795,
    "checkpoint_sync_time": 28,
    "buffers_checkpoint": 94,
    "buffers_clean": 0,
    "maxwritten_clean": 0,
    "buffers_backend": 23,
    "buffers_backend_fsync": 0,
    "buffers_alloc": 1267,
    "stats_reset": 1664442038
  },
  "backends": [
    {
      "db_name": "emanuelcalvo",
      "role_name": "emanuelcalvo",
      "application_name": "psql",
      "pid": 46109,
      "client_addr": "",
      "backend_start": 1674056444,
      "xact_start": 0,
      "query_start": 1674056623,
      "state_change": 1674056623,
      "wait_event_type": "Client",
      "wait_event": "ClientRead",
      "state": "idle",
      "backend_xid": 0,
      "backend_xmin": 0,
      "query": "SELECT d.datname as \"Name\",\n       pg_catalog.pg_get_userbyid(d.datdba) as \"Owner\",\n       pg_catalog.pg_encoding_to_char(d.encoding) as \"Encoding\",\n       d.datcollate as \"Collate\",\n       d.datctype as \"Ctype\",\n       pg_catalog.array_to_string(d.datacl, E'\\n') AS \"Access privileges\",\n       CASE WHEN pg_catalog.has_database_privilege(d.datname, 'CONNECT')\n            THEN pg_catalog.pg_size_pretty(pg_catalog.pg_database_size(d.datname))\n            ELSE 'No Access'\n       END as \"Size\",\n     "
    },
    {
      "db_name": "emanuelcalvo",
      "role_name": "emanuelcalvo",
      "application_name": "pgmetrics",
      "pid": 46607,
      "client_addr": "127.0.0.1/32",
      "backend_start": 1674056707,
      "xact_start": 1674056707,
      "query_start": 1674056707,
      "state_change": 1674056707,
      "wait_event_type": "",
      "wait_event": "",
      "state": "active",
      "backend_xid": 0,
      "backend_xmin": 52400640,
      "query": "SELECT COALESCE(datname, ''), COALESCE(usename, ''),\n\t\t\tCOALESCE(application_name, ''), COALESCE(pid, 0),\n\t\t\tCOALESCE(client_hostname::text, client_addr::text, ''),\n\t\t\tCOALESCE(EXTRACT(EPOCH FROM backend_start)::bigint, 0),\n\t\t\tCOALESCE(EXTRACT(EPOCH FROM xact_start)::bigint, 0),\n\t\t\tCOALESCE(EXTRACT(EPOCH FROM query_start)::bigint, 0),\n\t\t\tCOALESCE(EXTRACT(EPOCH FROM state_change)::bigint, 0),\n\t\t\tCOALESCE(wait_event_type, ''), COALESCE(wait_event, ''),\n\t\t\tCOALESCE(state, ''), COALESCE(backend_xid,"
    }
  ],
  "roles": [
    {
      "oid": 10,
      "name": "postgres",
      "rolsuper": true,
      "rolinherit": true,
      "rolcreaterole": true,
      "rolcreatedb": true,
      "rolcanlogin": true,
      "rolreplication": true,
      "rolbypassrls": true,
      "rolconnlimit": -1,
      "rolvaliduntil": 0,
      "memberof": []
    },
    {
      "oid": 3373,
      "name": "pg_monitor",
      "rolsuper": false,
      "rolinherit": true,
      "rolcreaterole": false,
      "rolcreatedb": false,
      "rolcanlogin": false,
      "rolreplication": false,
      "rolbypassrls": false,
      "rolconnlimit": -1,
      "rolvaliduntil": 0,
      "memberof": [
        "pg_read_all_settings",
        "pg_read_all_stats",
        "pg_stat_scan_tables"
      ]
    },
    {
      "oid": 3374,
      "name": "pg_read_all_settings",
      "rolsuper": false,
      "rolinherit": true,
      "rolcreaterole": false,
      "rolcreatedb": false,
      "rolcanlogin": false,
      "rolreplication": false,
      "rolbypassrls": false,
      "rolconnlimit": -1,
      "rolvaliduntil": 0,
      "memberof": []
    },
    {
      "oid": 3375,
      "name": "pg_read_all_stats",
      "rolsuper": false,
      "rolinherit": true,
      "rolcreaterole": false,
      "rolcreatedb": false,
      "rolcanlogin": false,
      "rolreplication": false,
      "rolbypassrls": false,
      "rolconnlimit": -1,
      "rolvaliduntil": 0,
      "memberof": []
    },
    {
      "oid": 3377,
      "name": "pg_stat_scan_tables",
      "rolsuper": false,
      "rolinherit": true,
      "rolcreaterole": false,
      "rolcreatedb": false,
      "rolcanlogin": false,
      "rolreplication": false,
      "rolbypassrls": false,
      "rolconnlimit": -1,
      "rolvaliduntil": 0,
      "memberof": []
    },
    {
      "oid": 4200,
      "name": "pg_signal_backend",
      "rolsuper": false,
      "rolinherit": true,
      "rolcreaterole": false,
      "rolcreatedb": false,
      "rolcanlogin": false,
      "rolreplication": false,
      "rolbypassrls": false,
      "rolconnlimit": -1,
      "rolvaliduntil": 0,
      "memberof": []
    },
    {
      "oid": 4569,
      "name": "pg_read_server_files",
      "rolsuper": false,
      "rolinherit": true,
      "rolcreaterole": false,
      "rolcreatedb": false,
      "rolcanlogin": false,
      "rolreplication": false,
      "rolbypassrls": false,
      "rolconnlimit": -1,
      "rolvaliduntil": 0,
      "memberof": []
    },
    {
      "oid": 4570,
      "name": "pg_write_server_files",
      "rolsuper": false,
      "rolinherit": true,
      "rolcreaterole": false,
      "rolcreatedb": false,
      "rolcanlogin": false,
      "rolreplication": false,
      "rolbypassrls": false,
      "rolconnlimit": -1,
      "rolvaliduntil": 0,
      "memberof": []
    },
    {
      "oid": 4571,
      "name": "pg_execute_server_program",
      "rolsuper": false,
      "rolinherit": true,
      "rolcreaterole": false,
      "rolcreatedb": false,
      "rolcanlogin": false,
      "rolreplication": false,
      "rolbypassrls": false,
      "rolconnlimit": -1,
      "rolvaliduntil": 0,
      "memberof": []
    },
    {
      "oid": 6171,
      "name": "pg_database_owner",
      "rolsuper": false,
      "rolinherit": true,
      "rolcreaterole": false,
      "rolcreatedb": false,
      "rolcanlogin": false,
      "rolreplication": false,
      "rolbypassrls": false,
      "rolconnlimit": -1,
      "rolvaliduntil": 0,
      "memberof": []
    },
    {
      "oid": 6181,
      "name": "pg_read_all_data",
      "rolsuper": false,
      "rolinherit": true,
      "rolcreaterole": false,
      "rolcreatedb": false,
      "rolcanlogin": false,
      "rolreplication": false,
      "rolbypassrls": false,
      "rolconnlimit": -1,
      "rolvaliduntil": 0,
      "memberof": []
    },
    {
      "oid": 6182,
      "name": "pg_write_all_data",
      "rolsuper": false,
      "rolinherit": true,
      "rolcreaterole": false,
      "rolcreatedb": false,
      "rolcanlogin": false,
      "rolreplication": false,
      "rolbypassrls": false,
      "rolconnlimit": -1,
      "rolvaliduntil": 0,
      "memberof": []
    },
    {
      "oid": 16384,
      "name": "emanuelcalvo",
      "rolsuper": true,
      "rolinherit": true,
      "rolcreaterole": true,
      "rolcreatedb": true,
      "rolcanlogin": true,
      "rolreplication": false,
      "rolbypassrls": false,
      "rolconnlimit": -1,
      "rolvaliduntil": 0,
      "memberof": []
    }
  ],
  "databases": [
    {
      "oid": 14021,
      "name": "postgres",
      "datdba": 10,
      "dattablespace": 1663,
      "datconnlimit": -1,
      "age_datfrozenxid": 52399914,
      "numbackends": 0,
      "xact_commit": 212,
      "xact_rollback": 1,
      "blks_read": 409,
      "blks_hit": 36358,
      "tup_returned": 109810,
      "tup_fetched": 14691,
      "tup_inserted": 0,
      "tup_updated": 0,
      "tup_deleted": 0,
      "conflicts": 0,
      "temp_files": 0,
      "temp_bytes": 0,
      "deadlocks": 0,
      "blk_read_time": 0,
      "blk_write_time": 0,
      "stats_reset": 1674053632,
      "size": 17269539
    },
    {
      "oid": 16385,
      "name": "emanuelcalvo",
      "datdba": 16384,
      "dattablespace": 1663,
      "datconnlimit": -1,
      "age_datfrozenxid": 52399914,
      "numbackends": 2,
      "xact_commit": 512,
      "xact_rollback": 25,
      "blks_read": 804,
      "blks_hit": 37422,
      "tup_returned": 219696,
      "tup_fetched": 17823,
      "tup_inserted": 67,
      "tup_updated": 21,
      "tup_deleted": 34,
      "conflicts": 0,
      "temp_files": 0,
      "temp_bytes": 0,
      "deadlocks": 0,
      "blk_read_time": 0,
      "blk_write_time": 0,
      "stats_reset": 1673455673,
      "size": 10368451363
    },
    {
      "oid": 17047,
      "name": "interview",
      "datdba": 16384,
      "dattablespace": 1663,
      "datconnlimit": -1,
      "age_datfrozenxid": 52399914,
      "numbackends": 0,
      "xact_commit": 0,
      "xact_rollback": 0,
      "blks_read": 0,
      "blks_hit": 0,
      "tup_returned": 0,
      "tup_fetched": 0,
      "tup_inserted": 0,
      "tup_updated": 0,
      "tup_deleted": 0,
      "conflicts": 0,
      "temp_files": 0,
      "temp_bytes": 0,
      "deadlocks": 0,
      "blk_read_time": 0,
      "blk_write_time": 0,
      "stats_reset": 0,
      "size": 1218937347
    }
  ],
  "tablespaces": [
    {
      "oid": 1663,
      "name": "pg_default",
      "owner": "postgres",
      "location": "/Users/emanuelcalvo/Library/Application Support/Postgres/var-14",
      "size": 11622109999,
      "disk_used": 0,
      "disk_total": 0,
      "inodes_used": 0,
      "inodes_total": 0
    },
    {
      "oid": 1664,
      "name": "pg_global",
      "owner": "postgres",
      "location": "/Users/emanuelcalvo/Library/Application Support/Postgres/var-14",
      "size": 720672,
      "disk_used": 0,
      "disk_total": 0,
      "inodes_used": 0,
      "inodes_total": 0
    }
  ],
  "tables": [
    {
      "oid": 16414,
      "db_name": "emanuelcalvo",
      "schema_name": "public",
      "name": "pgbench_history",
      "seq_scan": 0,
      "seq_tup_read": 0,
      "idx_scan": 0,
      "idx_tup_fetch": 0,
      "n_tup_ins": 0,
      "n_tup_upd": 0,
      "n_tup_del": 0,
      "n_tup_hot_upd": 0,
      "n_live_tup": 0,
      "n_dead_tup": 0,
      "n_mod_since_analyze": 0,
      "last_vacuum": 0,
      "last_autovacuum": 0,
      "last_analyze": 0,
      "last_autoanalyze": 0,
      "vacuum_count": 0,
      "autovacuum_count": 0,
      "analyze_count": 0,
      "autoanalyze_count": 0,
      "heap_blks_read": 0,
      "heap_blks_hit": 0,
      "idx_blks_read": 0,
      "idx_blks_hit": 0,
      "toast_blks_read": 0,
      "toast_blks_hit": 0,
      "tidx_blks_read": 0,
      "tidx_blks_hit": 0,
      "size": 8192,
      "bloat": -1,
      "relkind": "r",
      "relpersistence": "p",
      "relnatts": 6,
      "age_relfrozenxid": 35,
      "relispartition": false,
      "tablespace_name": "",
      "parent_name": "",
      "partition_cv": ""
    },
    {
      "oid": 16417,
      "db_name": "emanuelcalvo",
      "schema_name": "public",
      "name": "pgbench_tellers",
      "seq_scan": 0,
      "seq_tup_read": 0,
      "idx_scan": 0,
      "idx_tup_fetch": 0,
      "n_tup_ins": 0,
      "n_tup_upd": 0,
      "n_tup_del": 0,
      "n_tup_hot_upd": 0,
      "n_live_tup": 0,
      "n_dead_tup": 0,
      "n_mod_since_analyze": 0,
      "last_vacuum": 0,
      "last_autovacuum": 0,
      "last_analyze": 0,
      "last_autoanalyze": 0,
      "vacuum_count": 0,
      "autovacuum_count": 0,
      "analyze_count": 0,
      "autoanalyze_count": 0,
      "heap_blks_read": 0,
      "heap_blks_hit": 0,
      "idx_blks_read": 0,
      "idx_blks_hit": 0,
      "toast_blks_read": 0,
      "toast_blks_hit": 0,
      "tidx_blks_read": 0,
      "tidx_blks_hit": 0,
      "size": 242245632,
      "bloat": 241811456,
      "relkind": "r",
      "relpersistence": "p",
      "relnatts": 4,
      "age_relfrozenxid": 50000289,
      "relispartition": false,
      "tablespace_name": "",
      "parent_name": "",
      "partition_cv": ""
    },
    {
      "oid": 16420,
      "db_name": "emanuelcalvo",
      "schema_name": "public",
      "name": "pgbench_accounts",
      "seq_scan": 0,
      "seq_tup_read": 0,
      "idx_scan": 0,
      "idx_tup_fetch": 0,
      "n_tup_ins": 0,
      "n_tup_upd": 0,
      "n_tup_del": 0,
      "n_tup_hot_upd": 0,
      "n_live_tup": 0,
      "n_dead_tup": 0,
      "n_mod_since_analyze": 0,
      "last_vacuum": 0,
      "last_autovacuum": 0,
      "last_analyze": 0,
      "last_autoanalyze": 0,
      "vacuum_count": 0,
      "autovacuum_count": 0,
      "analyze_count": 0,
      "autoanalyze_count": 0,
      "heap_blks_read": 0,
      "heap_blks_hit": 0,
      "idx_blks_read": 0,
      "idx_blks_hit": 0,
      "toast_blks_read": 0,
      "toast_blks_hit": 0,
      "tidx_blks_read": 0,
      "tidx_blks_hit": 0,
      "size": 7623450624,
      "bloat": 1005191168,
      "relkind": "r",
      "relpersistence": "p",
      "relnatts": 4,
      "age_relfrozenxid": 52399888,
      "relispartition": false,
      "tablespace_name": "",
      "parent_name": "",
      "partition_cv": ""
    },
    {
      "oid": 16423,
      "db_name": "emanuelcalvo",
      "schema_name": "public",
      "name": "pgbench_branches",
      "seq_scan": 0,
      "seq_tup_read": 0,
      "idx_scan": 0,
      "idx_tup_fetch": 0,
      "n_tup_ins": 0,
      "n_tup_upd": 0,
      "n_tup_del": 0,
      "n_tup_hot_upd": 0,
      "n_live_tup": 0,
      "n_dead_tup": 0,
      "n_mod_since_analyze": 0,
      "last_vacuum": 0,
      "last_autovacuum": 0,
      "last_analyze": 0,
      "last_autoanalyze": 0,
      "vacuum_count": 0,
      "autovacuum_count": 0,
      "analyze_count": 0,
      "autoanalyze_count": 0,
      "heap_blks_read": 0,
      "heap_blks_hit": 0,
      "idx_blks_read": 0,
      "idx_blks_hit": 0,
      "toast_blks_read": 0,
      "toast_blks_hit": 0,
      "tidx_blks_read": 0,
      "tidx_blks_hit": 0,
      "size": 198008832,
      "bloat": 197902336,
      "relkind": "r",
      "relpersistence": "p",
      "relnatts": 3,
      "age_relfrozenxid": 50000289,
      "relispartition": false,
      "tablespace_name": "",
      "parent_name": "",
      "partition_cv": ""
    },
    {
      "oid": 16440,
      "db_name": "emanuelcalvo",
      "schema_name": "public",
      "name": "aa",
      "seq_scan": 0,
      "seq_tup_read": 0,
      "idx_scan": 0,
      "idx_tup_fetch": 0,
      "n_tup_ins": 0,
      "n_tup_upd": 0,
      "n_tup_del": 0,
      "n_tup_hot_upd": 0,
      "n_live_tup": 0,
      "n_dead_tup": 0,
      "n_mod_since_analyze": 0,
      "last_vacuum": 0,
      "last_autovacuum": 0,
      "last_analyze": 0,
      "last_autoanalyze": 0,
      "vacuum_count": 0,
      "autovacuum_count": 0,
      "analyze_count": 0,
      "autoanalyze_count": 0,
      "heap_blks_read": 0,
      "heap_blks_hit": 0,
      "idx_blks_read": 0,
      "idx_blks_hit": 0,
      "toast_blks_read": 0,
      "toast_blks_hit": 0,
      "tidx_blks_read": 0,
      "tidx_blks_hit": 0,
      "size": 0,
      "bloat": -1,
      "relkind": "r",
      "relpersistence": "p",
      "relnatts": 0,
      "age_relfrozenxid": 11316041,
      "relispartition": false,
      "tablespace_name": "",
      "parent_name": "",
      "partition_cv": ""
    },
    {
      "oid": 16443,
      "db_name": "emanuelcalvo",
      "schema_name": "public",
      "name": "aa1",
      "seq_scan": 0,
      "seq_tup_read": 0,
      "idx_scan": 0,
      "idx_tup_fetch": 0,
      "n_tup_ins": 0,
      "n_tup_upd": 0,
      "n_tup_del": 0,
      "n_tup_hot_upd": 0,
      "n_live_tup": 0,
      "n_dead_tup": 0,
      "n_mod_since_analyze": 0,
      "last_vacuum": 0,
      "last_autovacuum": 0,
      "last_analyze": 0,
      "last_autoanalyze": 0,
      "vacuum_count": 0,
      "autovacuum_count": 0,
      "analyze_count": 0,
      "autoanalyze_count": 0,
      "heap_blks_read": 0,
      "heap_blks_hit": 0,
      "idx_blks_read": 0,
      "idx_blks_hit": 0,
      "toast_blks_read": 0,
      "toast_blks_hit": 0,
      "tidx_blks_read": 0,
      "tidx_blks_hit": 0,
      "size": 98304,
      "bloat": -1,
      "relkind": "r",
      "relpersistence": "p",
      "relnatts": 1,
      "age_relfrozenxid": 11315555,
      "relispartition": false,
      "tablespace_name": "",
      "parent_name": "",
      "partition_cv": ""
    },
    {
      "oid": 17030,
      "db_name": "emanuelcalvo",
      "schema_name": "public",
      "name": "activities",
      "seq_scan": 0,
      "seq_tup_read": 0,
      "idx_scan": 0,
      "idx_tup_fetch": 0,
      "n_tup_ins": 0,
      "n_tup_upd": 0,
      "n_tup_del": 0,
      "n_tup_hot_upd": 0,
      "n_live_tup": 0,
      "n_dead_tup": 0,
      "n_mod_since_analyze": 0,
      "last_vacuum": 0,
      "last_autovacuum": 0,
      "last_analyze": 0,
      "last_autoanalyze": 0,
      "vacuum_count": 0,
      "autovacuum_count": 0,
      "analyze_count": 0,
      "autoanalyze_count": 0,
      "heap_blks_read": 0,
      "heap_blks_hit": 0,
      "idx_blks_read": 0,
      "idx_blks_hit": 0,
      "toast_blks_read": 0,
      "toast_blks_hit": 0,
      "tidx_blks_read": 0,
      "tidx_blks_hit": 0,
      "size": 32808960,
      "bloat": 286720,
      "relkind": "r",
      "relpersistence": "p",
      "relnatts": 3,
      "age_relfrozenxid": 216,
      "relispartition": false,
      "tablespace_name": "",
      "parent_name": "",
      "partition_cv": ""
    },
    {
      "oid": 58018,
      "db_name": "emanuelcalvo",
      "schema_name": "public",
      "name": "labels",
      "seq_scan": 7,
      "seq_tup_read": 4,
      "idx_scan": 0,
      "idx_tup_fetch": 0,
      "n_tup_ins": 2,
      "n_tup_upd": 0,
      "n_tup_del": 0,
      "n_tup_hot_upd": 0,
      "n_live_tup": 2,
      "n_dead_tup": 0,
      "n_mod_since_analyze": 2,
      "last_vacuum": 0,
      "last_autovacuum": 0,
      "last_analyze": 0,
      "last_autoanalyze": 0,
      "vacuum_count": 0,
      "autovacuum_count": 0,
      "analyze_count": 0,
      "autoanalyze_count": 0,
      "heap_blks_read": 1,
      "heap_blks_hit": 3,
      "idx_blks_read": 4,
      "idx_blks_hit": 8,
      "toast_blks_read": 0,
      "toast_blks_hit": 0,
      "tidx_blks_read": 0,
      "tidx_blks_hit": 0,
      "size": 16384,
      "bloat": -1,
      "relkind": "r",
      "relpersistence": "p",
      "relnatts": 3,
      "age_relfrozenxid": 5,
      "relispartition": false,
      "tablespace_name": "",
      "parent_name": "",
      "partition_cv": ""
    },
    {
      "oid": 58217,
      "db_name": "emanuelcalvo",
      "schema_name": "public",
      "name": "todo_active_2022",
      "seq_scan": 1,
      "seq_tup_read": 2,
      "idx_scan": 0,
      "idx_tup_fetch": 0,
      "n_tup_ins": 0,
      "n_tup_upd": 0,
      "n_tup_del": 0,
      "n_tup_hot_upd": 0,
      "n_live_tup": 0,
      "n_dead_tup": 0,
      "n_mod_since_analyze": 0,
      "last_vacuum": 0,
      "last_autovacuum": 0,
      "last_analyze": 0,
      "last_autoanalyze": 0,
      "vacuum_count": 0,
      "autovacuum_count": 0,
      "analyze_count": 0,
      "autoanalyze_count": 0,
      "heap_blks_read": 1,
      "heap_blks_hit": 0,
      "idx_blks_read": 1,
      "idx_blks_hit": 0,
      "toast_blks_read": 0,
      "toast_blks_hit": 0,
      "tidx_blks_read": 0,
      "tidx_blks_hit": 0,
      "size": 16384,
      "bloat": -1,
      "relkind": "r",
      "relpersistence": "p",
      "relnatts": 6,
      "age_relfrozenxid": 144,
      "relispartition": true,
      "tablespace_name": "",
      "parent_name": "todo_active",
      "partition_cv": "FOR VALUES FROM ('2022-01-01 00:00:00') TO ('2022-12-31 00:00:00')"
    }
  ],
  "indexes": [
    {
      "oid": 16432,
      "db_name": "emanuelcalvo",
      "schema_name": "public",
      "table_oid": 16417,
      "table_name": "pgbench_tellers",
      "name": "pgbench_tellers_pkey",
      "idx_scan": 0,
      "idx_tup_read": 0,
      "idx_tup_fetch": 0,
      "idx_blks_read": 0,
      "idx_blks_hit": 0,
      "size": 131072,
      "bloat": 8192,
      "relnatts": 1,
      "amname": "btree",
      "tablespace_name": "",
      "def": "CREATE UNIQUE INDEX pgbench_tellers_pkey ON public.pgbench_tellers USING btree (tid)"
    },
    {
      "oid": 16434,
      "db_name": "emanuelcalvo",
      "schema_name": "public",
      "table_oid": 16420,
      "table_name": "pgbench_accounts",
      "name": "pgbench_accounts_pkey",
      "idx_scan": 0,
      "idx_tup_read": 0,
      "idx_tup_fetch": 0,
      "idx_blks_read": 0,
      "idx_blks_hit": 0,
      "size": 1123115008,
      "bloat": 0,
      "relnatts": 1,
      "amname": "btree",
      "tablespace_name": "",
      "def": "CREATE UNIQUE INDEX pgbench_accounts_pkey ON public.pgbench_accounts USING btree (aid)"
    },
    {
      "oid": 58252,
      "db_name": "emanuelcalvo",
      "schema_name": "public",
      "table_oid": 16420,
      "table_name": "pgbench_accounts",
      "name": "pgbench_accounts_pkey_ccnew",
      "idx_scan": 0,
      "idx_tup_read": 0,
      "idx_tup_fetch": 0,
      "idx_blks_read": 0,
      "idx_blks_hit": 0,
      "size": 1123115008,
      "bloat": 0,
      "relnatts": 1,
      "amname": "btree",
      "tablespace_name": "",
      "def": "CREATE UNIQUE INDEX pgbench_accounts_pkey_ccnew ON public.pgbench_accounts USING btree (aid)"
    },
    {
      "oid": 16430,
      "db_name": "emanuelcalvo",
      "schema_name": "public",
      "table_oid": 16423,
      "table_name": "pgbench_branches",
      "name": "pgbench_branches_pkey",
      "idx_scan": 0,
      "idx_tup_read": 0,
      "idx_tup_fetch": 0,
      "idx_blks_read": 0,
      "idx_blks_hit": 0,
      "size": 32768,
      "bloat": 16384,
      "relnatts": 1,
      "amname": "btree",
      "tablespace_name": "",
      "def": "CREATE UNIQUE INDEX pgbench_branches_pkey ON public.pgbench_branches USING btree (bid)"
    },
    {
      "oid": 58247,
      "db_name": "emanuelcalvo",
      "schema_name": "public",
      "table_oid": 17030,
      "table_name": "activities",
      "name": "activities_pkey",
      "idx_scan": 0,
      "idx_tup_read": 0,
      "idx_tup_fetch": 0,
      "idx_blks_read": 0,
      "idx_blks_hit": 0,
      "size": 2260992,
      "bloat": 0,
      "relnatts": 1,
      "amname": "btree",
      "tablespace_name": "",
      "def": "CREATE UNIQUE INDEX activities_pkey ON public.activities USING btree (id)"
    },
    {
      "oid": 58248,
      "db_name": "emanuelcalvo",
      "schema_name": "public",
      "table_oid": 17030,
      "table_name": "activities",
      "name": "ix_activities_trigram",
      "idx_scan": 0,
      "idx_tup_read": 0,
      "idx_tup_fetch": 0,
      "idx_blks_read": 0,
      "idx_blks_hit": 0,
      "size": 13590528,
      "bloat": 0,
      "relnatts": 2,
      "amname": "gin",
      "tablespace_name": "",
      "def": "CREATE INDEX ix_activities_trigram ON public.activities USING gin (space_id, key gin_trgm_ops)"
    },
    {
      "oid": 59476,
      "db_name": "emanuelcalvo",
      "schema_name": "public",
      "table_oid": 58018,
      "table_name": "labels",
      "name": "labels_gencol_idx",
      "idx_scan": 0,
      "idx_tup_read": 0,
      "idx_tup_fetch": 0,
      "idx_blks_read": 0,
      "idx_blks_hit": 0,
      "size": 16384,
      "bloat": -1,
      "relnatts": 1,
      "amname": "btree",
      "tablespace_name": "",
      "def": "CREATE INDEX labels_gencol_idx ON public.labels USING btree (gencol)"
    },
    {
      "oid": 59467,
      "db_name": "emanuelcalvo",
      "schema_name": "public",
      "table_oid": 58018,
      "table_name": "labels",
      "name": "label_ix",
      "idx_scan": 0,
      "idx_tup_read": 0,
      "idx_tup_fetch": 0,
      "idx_blks_read": 2,
      "idx_blks_hit": 4,
      "size": 16384,
      "bloat": -1,
      "relnatts": 1,
      "amname": "btree",
      "tablespace_name": "",
      "def": "CREATE INDEX label_ix ON public.labels USING btree (\"left\"((id)::text, 12))"
    },
    {
      "oid": 58250,
      "db_name": "emanuelcalvo",
      "schema_name": "public",
      "table_oid": 58018,
      "table_name": "labels",
      "name": "labels_pkey",
      "idx_scan": 0,
      "idx_tup_read": 0,
      "idx_tup_fetch": 0,
      "idx_blks_read": 2,
      "idx_blks_hit": 4,
      "size": 16384,
      "bloat": -1,
      "relnatts": 1,
      "amname": "btree",
      "tablespace_name": "",
      "def": "CREATE UNIQUE INDEX labels_pkey ON public.labels USING btree (id)"
    },
    {
      "oid": 58221,
      "db_name": "emanuelcalvo",
      "schema_name": "public",
      "table_oid": 58217,
      "table_name": "todo_active_2022",
      "name": "todo_active_2022_pkey",
      "idx_scan": 0,
      "idx_tup_read": 0,
      "idx_tup_fetch": 0,
      "idx_blks_read": 1,
      "idx_blks_hit": 0,
      "size": 16384,
      "bloat": -1,
      "relnatts": 3,
      "amname": "btree",
      "tablespace_name": "",
      "def": "CREATE UNIQUE INDEX todo_active_2022_pkey ON public.todo_active_2022 USING btree (state_task, date_of, id)"
    }
  ],
  "sequences": [
    {
      "oid": 17029,
      "db_name": "emanuelcalvo",
      "schema_name": "public",
      "name": "activities_id_seq",
      "blks_read": 0,
      "blks_hit": 0
    },
    {
      "oid": 58017,
      "db_name": "emanuelcalvo",
      "schema_name": "public",
      "name": "labels_id_seq",
      "blks_read": 0,
      "blks_hit": 0
    },
    {
      "oid": 58186,
      "db_name": "emanuelcalvo",
      "schema_name": "public",
      "name": "todo_id_seq",
      "blks_read": 0,
      "blks_hit": 0
    }
  ],
  "extensions": [
    {
      "name": "btree_gin",
      "db_name": "emanuelcalvo",
      "default_version": "1.3",
      "installed_version": "1.3",
      "comment": "support for indexing common datatypes in GIN"
    },
    {
      "name": "pg_buffercache",
      "db_name": "emanuelcalvo",
      "default_version": "1.3",
      "installed_version": "1.3",
      "comment": "examine the shared buffer cache"
    },
    {
      "name": "pg_trgm",
      "db_name": "emanuelcalvo",
      "default_version": "1.6",
      "installed_version": "1.6",
      "comment": "text similarity measurement and index searching based on trigrams"
    },
    {
      "name": "plpgsql",
      "db_name": "emanuelcalvo",
      "default_version": "1.0",
      "installed_version": "1.0",
      "comment": "PL/pgSQL procedural language"
    }
  ],
  "system": {
    "num_cores": 0,
    "loadavg": 2.91,
    "memused": 845045760,
    "memfree": 5709197312,
    "membuffers": 132050944,
    "memcached": 1449443328,
    "swapused": 0,
    "swapfree": 1073737728,
    "hostname": "81fa728b4e75",
    "memslab": 202051584
  },
  "settings": {
    "DateStyle": {
      "setting": "ISO, MDY"
    },
    "IntervalStyle": {
      "setting": "postgres"
    },
    "TimeZone": {
      "setting": "Europe/Madrid",
      "bootval": "GMT",
      "source": "/Users/emanuelcalvo/Library/Application Support/Postgres/var-14/postgresql.conf:696"
    },
    "allow_in_place_tablespaces": {
      "setting": "off"
    },
    "allow_system_table_mods": {
      "setting": "off"
    },
    "application_name": {
      "setting": "pgmetrics",
      "source": "client"
    },
    "archive_cleanup_command": {
      "setting": ""
    },
    "archive_command": {
      "setting": "(disabled)",
      "source": "default"
    },
    "archive_mode": {
      "setting": "off"
    },
    "archive_timeout": {
      "setting": "0"
    },
    "array_nulls": {
      "setting": "on"
    },
    "authentication_timeout": {
      "setting": "60"
    },
    "autovacuum": {
      "setting": "on"
    },
    "autovacuum_analyze_scale_factor": {
      "setting": "0.1"
    },
    "autovacuum_analyze_threshold": {
      "setting": "50"
    },
    "autovacuum_freeze_max_age": {
      "setting": "200000000"
    },
    "autovacuum_max_workers": {
      "setting": "3"
    },
    "autovacuum_multixact_freeze_max_age": {
      "setting": "400000000"
    },
    "autovacuum_naptime": {
      "setting": "60"
    },
    "autovacuum_vacuum_cost_delay": {
      "setting": "2"
    },
    "autovacuum_vacuum_cost_limit": {
      "setting": "-1"
    },
    "autovacuum_vacuum_insert_scale_factor": {
      "setting": "0.2"
    },
    "autovacuum_vacuum_insert_threshold": {
      "setting": "1000"
    },
    "autovacuum_vacuum_scale_factor": {
      "setting": "0.2"
    },
    "autovacuum_vacuum_threshold": {
      "setting": "50"
    },
    "autovacuum_work_mem": {
      "setting": "-1"
    },
    "backend_flush_after": {
      "setting": "0"
    },
    "backslash_quote": {
      "setting": "safe_encoding"
    },
    "backtrace_functions": {
      "setting": ""
    },
    "bgwriter_delay": {
      "setting": "200"
    },
    "bgwriter_flush_after": {
      "setting": "0"
    },
    "bgwriter_lru_maxpages": {
      "setting": "100"
    },
    "bgwriter_lru_multiplier": {
      "setting": "2"
    },
    "block_size": {
      "setting": "8192"
    },
    "bonjour": {
      "setting": "off"
    },
    "bonjour_name": {
      "setting": ""
    },
    "bytea_output": {
      "setting": "hex"
    },
    "check_function_bodies": {
      "setting": "on"
    },
    "checkpoint_completion_target": {
      "setting": "0.9"
    },
    "checkpoint_flush_after": {
      "setting": "0"
    },
    "checkpoint_timeout": {
      "setting": "300"
    },
    "checkpoint_warning": {
      "setting": "30"
    },
    "client_connection_check_interval": {
      "setting": "0"
    },
    "client_encoding": {
      "setting": "UTF8",
      "bootval": "SQL_ASCII",
      "source": "client"
    },
    "client_min_messages": {
      "setting": "notice"
    },
    "cluster_name": {
      "setting": ""
    },
    "commit_delay": {
      "setting": "0"
    },
    "commit_siblings": {
      "setting": "5"
    },
    "compute_query_id": {
      "setting": "auto"
    },
    "config_file": {
      "setting": "/Users/emanuelcalvo/Library/Application Support/Postgres/var-14/postgresql.conf",
      "source": "override"
    },
    "constraint_exclusion": {
      "setting": "partition"
    },
    "cpu_index_tuple_cost": {
      "setting": "0.005"
    },
    "cpu_operator_cost": {
      "setting": "0.0025"
    },
    "cpu_tuple_cost": {
      "setting": "0.01"
    },
    "cursor_tuple_fraction": {
      "setting": "0.1"
    },
    "data_checksums": {
      "setting": "off"
    },
    "data_directory": {
      "setting": "/Users/emanuelcalvo/Library/Application Support/Postgres/var-14",
      "source": "override"
    },
    "data_directory_mode": {
      "setting": "0700",
      "bootval": "448",
      "source": "default"
    },
    "data_sync_retry": {
      "setting": "off"
    },
    "db_user_namespace": {
      "setting": "off"
    },
    "deadlock_timeout": {
      "setting": "1000"
    },
    "debug_assertions": {
      "setting": "off"
    },
    "debug_discard_caches": {
      "setting": "0"
    },
    "debug_pretty_print": {
      "setting": "on"
    },
    "debug_print_parse": {
      "setting": "off"
    },
    "debug_print_plan": {
      "setting": "off"
    },
    "debug_print_rewritten": {
      "setting": "off"
    },
    "default_statistics_target": {
      "setting": "100"
    },
    "default_table_access_method": {
      "setting": "heap"
    },
    "default_tablespace": {
      "setting": ""
    },
    "default_text_search_config": {
      "setting": "pg_catalog.english",
      "bootval": "pg_catalog.simple",
      "source": "/Users/emanuelcalvo/Library/Application Support/Postgres/var-14/postgresql.conf:717"
    },
    "default_toast_compression": {
      "setting": "pglz"
    },
    "default_transaction_deferrable": {
      "setting": "off"
    },
    "default_transaction_isolation": {
      "setting": "read committed"
    },
    "default_transaction_read_only": {
      "setting": "off"
    },
    "dynamic_library_path": {
      "setting": "$libdir"
    },
    "dynamic_shared_memory_type": {
      "setting": "posix"
    },
    "effective_cache_size": {
      "setting": "524288"
    },
    "effective_io_concurrency": {
      "setting": "0"
    },
    "enable_async_append": {
      "setting": "on"
    },
    "enable_bitmapscan": {
      "setting": "on"
    },
    "enable_gathermerge": {
      "setting": "on"
    },
    "enable_hashagg": {
      "setting": "on"
    },
    "enable_hashjoin": {
      "setting": "on"
    },
    "enable_incremental_sort": {
      "setting": "on"
    },
    "enable_indexonlyscan": {
      "setting": "on"
    },
    "enable_indexscan": {
      "setting": "on"
    },
    "enable_material": {
      "setting": "on"
    },
    "enable_memoize": {
      "setting": "on"
    },
    "enable_mergejoin": {
      "setting": "on"
    },
    "enable_nestloop": {
      "setting": "on"
    },
    "enable_parallel_append": {
      "setting": "on"
    },
    "enable_parallel_hash": {
      "setting": "on"
    },
    "enable_partition_pruning": {
      "setting": "on"
    },
    "enable_partitionwise_aggregate": {
      "setting": "off"
    },
    "enable_partitionwise_join": {
      "setting": "off"
    },
    "enable_seqscan": {
      "setting": "on"
    },
    "enable_sort": {
      "setting": "on"
    },
    "enable_tidscan": {
      "setting": "on"
    },
    "escape_string_warning": {
      "setting": "on"
    },
    "event_source": {
      "setting": "PostgreSQL"
    },
    "exit_on_error": {
      "setting": "off"
    },
    "external_pid_file": {
      "setting": ""
    },
    "extra_float_digits": {
      "setting": "1"
    },
    "force_parallel_mode": {
      "setting": "off"
    },
    "from_collapse_limit": {
      "setting": "8"
    },
    "fsync": {
      "setting": "on"
    },
    "full_page_writes": {
      "setting": "on"
    },
    "geqo": {
      "setting": "on"
    },
    "geqo_effort": {
      "setting": "5"
    },
    "geqo_generations": {
      "setting": "0"
    },
    "geqo_pool_size": {
      "setting": "0"
    },
    "geqo_seed": {
      "setting": "0"
    },
    "geqo_selection_bias": {
      "setting": "2"
    },
    "geqo_threshold": {
      "setting": "12"
    },
    "gin_fuzzy_search_limit": {
      "setting": "0"
    },
    "gin_pending_list_limit": {
      "setting": "4096"
    },
    "hash_mem_multiplier": {
      "setting": "1"
    },
    "hba_file": {
      "setting": "/Users/emanuelcalvo/Library/Application Support/Postgres/var-14/pg_hba.conf",
      "source": "override"
    },
    "hot_standby": {
      "setting": "on"
    },
    "hot_standby_feedback": {
      "setting": "off"
    },
    "huge_page_size": {
      "setting": "0"
    },
    "huge_pages": {
      "setting": "try"
    },
    "ident_file": {
      "setting": "/Users/emanuelcalvo/Library/Application Support/Postgres/var-14/pg_ident.conf",
      "source": "override"
    },
    "idle_in_transaction_session_timeout": {
      "setting": "0"
    },
    "idle_session_timeout": {
      "setting": "0"
    },
    "ignore_checksum_failure": {
      "setting": "off"
    },
    "ignore_invalid_pages": {
      "setting": "off"
    },
    "ignore_system_indexes": {
      "setting": "off"
    },
    "in_hot_standby": {
      "setting": "off"
    },
    "integer_datetimes": {
      "setting": "on"
    },
    "jit": {
      "setting": "on"
    },
    "jit_above_cost": {
      "setting": "100000"
    },
    "jit_debugging_support": {
      "setting": "off"
    },
    "jit_dump_bitcode": {
      "setting": "off"
    },
    "jit_expressions": {
      "setting": "on"
    },
    "jit_inline_above_cost": {
      "setting": "500000"
    },
    "jit_optimize_above_cost": {
      "setting": "500000"
    },
    "jit_profiling_support": {
      "setting": "off"
    },
    "jit_provider": {
      "setting": "llvmjit"
    },
    "jit_tuple_deforming": {
      "setting": "on"
    },
    "join_collapse_limit": {
      "setting": "8"
    },
    "krb_caseins_users": {
      "setting": "off"
    },
    "krb_server_keyfile": {
      "setting": ""
    },
    "lc_collate": {
      "setting": "en_US.UTF-8",
      "bootval": "C",
      "source": "override"
    },
    "lc_ctype": {
      "setting": "en_US.UTF-8",
      "bootval": "C",
      "source": "override"
    },
    "lc_messages": {
      "setting": "en_US.UTF-8",
      "source": "/Users/emanuelcalvo/Library/Application Support/Postgres/var-14/postgresql.conf:710"
    },
    "lc_monetary": {
      "setting": "en_US.UTF-8",
      "bootval": "C",
      "source": "/Users/emanuelcalvo/Library/Application Support/Postgres/var-14/postgresql.conf:712"
    },
    "lc_numeric": {
      "setting": "en_US.UTF-8",
      "bootval": "C",
      "source": "/Users/emanuelcalvo/Library/Application Support/Postgres/var-14/postgresql.conf:713"
    },
    "lc_time": {
      "setting": "en_US.UTF-8",
      "bootval": "C",
      "source": "/Users/emanuelcalvo/Library/Application Support/Postgres/var-14/postgresql.conf:714"
    },
    "listen_addresses": {
      "setting": "localhost"
    },
    "lo_compat_privileges": {
      "setting": "off"
    },
    "local_preload_libraries": {
      "setting": ""
    },
    "lock_timeout": {
      "setting": "50",
      "bootval": "0",
      "source": "client"
    },
    "log_autovacuum_min_duration": {
      "setting": "-1"
    },
    "log_checkpoints": {
      "setting": "off"
    },
    "log_connections": {
      "setting": "off"
    },
    "log_destination": {
      "setting": "stderr"
    },
    "log_directory": {
      "setting": "log"
    },
    "log_disconnections": {
      "setting": "off"
    },
    "log_duration": {
      "setting": "off"
    },
    "log_error_verbosity": {
      "setting": "default"
    },
    "log_executor_stats": {
      "setting": "off"
    },
    "log_file_mode": {
      "setting": "0600",
      "bootval": "384",
      "source": "default"
    },
    "log_filename": {
      "setting": "postgresql-%Y-%m-%d_%H%M%S.log"
    },
    "log_hostname": {
      "setting": "off"
    },
    "log_line_prefix": {
      "setting": "%m [%p] "
    },
    "log_lock_waits": {
      "setting": "off"
    },
    "log_min_duration_sample": {
      "setting": "-1"
    },
    "log_min_duration_statement": {
      "setting": "-1"
    },
    "log_min_error_statement": {
      "setting": "error"
    },
    "log_min_messages": {
      "setting": "warning"
    },
    "log_parameter_max_length": {
      "setting": "-1"
    },
    "log_parameter_max_length_on_error": {
      "setting": "0"
    },
    "log_parser_stats": {
      "setting": "off"
    },
    "log_planner_stats": {
      "setting": "off"
    },
    "log_recovery_conflict_waits": {
      "setting": "off"
    },
    "log_replication_commands": {
      "setting": "off"
    },
    "log_rotation_age": {
      "setting": "1440"
    },
    "log_rotation_size": {
      "setting": "10240"
    },
    "log_statement": {
      "setting": "none"
    },
    "log_statement_sample_rate": {
      "setting": "1"
    },
    "log_statement_stats": {
      "setting": "off"
    },
    "log_temp_files": {
      "setting": "-1"
    },
    "log_timezone": {
      "setting": "Europe/Madrid",
      "bootval": "GMT",
      "source": "/Users/emanuelcalvo/Library/Application Support/Postgres/var-14/postgresql.conf:580"
    },
    "log_transaction_sample_rate": {
      "setting": "0"
    },
    "log_truncate_on_rotation": {
      "setting": "off"
    },
    "logging_collector": {
      "setting": "off"
    },
    "logical_decoding_work_mem": {
      "setting": "65536"
    },
    "maintenance_io_concurrency": {
      "setting": "0"
    },
    "maintenance_work_mem": {
      "setting": "65536"
    },
    "max_connections": {
      "setting": "100"
    },
    "max_files_per_process": {
      "setting": "1000"
    },
    "max_function_args": {
      "setting": "100"
    },
    "max_identifier_length": {
      "setting": "63"
    },
    "max_index_keys": {
      "setting": "32"
    },
    "max_locks_per_transaction": {
      "setting": "64"
    },
    "max_logical_replication_workers": {
      "setting": "4"
    },
    "max_parallel_maintenance_workers": {
      "setting": "2"
    },
    "max_parallel_workers": {
      "setting": "8"
    },
    "max_parallel_workers_per_gather": {
      "setting": "2"
    },
    "max_pred_locks_per_page": {
      "setting": "2"
    },
    "max_pred_locks_per_relation": {
      "setting": "-2"
    },
    "max_pred_locks_per_transaction": {
      "setting": "64"
    },
    "max_prepared_transactions": {
      "setting": "0"
    },
    "max_replication_slots": {
      "setting": "10"
    },
    "max_slot_wal_keep_size": {
      "setting": "-1"
    },
    "max_stack_depth": {
      "setting": "2048",
      "bootval": "100",
      "source": "environment variable"
    },
    "max_standby_archive_delay": {
      "setting": "30000"
    },
    "max_standby_streaming_delay": {
      "setting": "30000"
    },
    "max_sync_workers_per_subscription": {
      "setting": "2"
    },
    "max_wal_senders": {
      "setting": "10"
    },
    "max_wal_size": {
      "setting": "1024"
    },
    "max_worker_processes": {
      "setting": "8"
    },
    "min_dynamic_shared_memory": {
      "setting": "0"
    },
    "min_parallel_index_scan_size": {
      "setting": "64"
    },
    "min_parallel_table_scan_size": {
      "setting": "1024"
    },
    "min_wal_size": {
      "setting": "80"
    },
    "old_snapshot_threshold": {
      "setting": "-1"
    },
    "parallel_leader_participation": {
      "setting": "on"
    },
    "parallel_setup_cost": {
      "setting": "1000"
    },
    "parallel_tuple_cost": {
      "setting": "0.1"
    },
    "password_encryption": {
      "setting": "scram-sha-256"
    },
    "plan_cache_mode": {
      "setting": "auto"
    },
    "port": {
      "setting": "5432"
    },
    "post_auth_delay": {
      "setting": "0"
    },
    "pre_auth_delay": {
      "setting": "0"
    },
    "primary_conninfo": {
      "setting": ""
    },
    "primary_slot_name": {
      "setting": ""
    },
    "promote_trigger_file": {
      "setting": ""
    },
    "quote_all_identifiers": {
      "setting": "off"
    },
    "random_page_cost": {
      "setting": "4"
    },
    "recovery_end_command": {
      "setting": ""
    },
    "recovery_init_sync_method": {
      "setting": "fsync"
    },
    "recovery_min_apply_delay": {
      "setting": "0"
    },
    "recovery_target": {
      "setting": ""
    },
    "recovery_target_action": {
      "setting": "pause"
    },
    "recovery_target_inclusive": {
      "setting": "on"
    },
    "recovery_target_lsn": {
      "setting": ""
    },
    "recovery_target_name": {
      "setting": ""
    },
    "recovery_target_time": {
      "setting": ""
    },
    "recovery_target_timeline": {
      "setting": "latest"
    },
    "recovery_target_xid": {
      "setting": ""
    },
    "remove_temp_files_after_crash": {
      "setting": "on"
    },
    "restart_after_crash": {
      "setting": "on"
    },
    "restore_command": {
      "setting": ""
    },
    "row_security": {
      "setting": "on"
    },
    "search_path": {
      "setting": "\"$user\", public"
    },
    "segment_size": {
      "setting": "131072"
    },
    "seq_page_cost": {
      "setting": "1"
    },
    "server_encoding": {
      "setting": "UTF8",
      "bootval": "SQL_ASCII",
      "source": "override"
    },
    "server_version": {
      "setting": "14.6"
    },
    "server_version_num": {
      "setting": "140006"
    },
    "session_preload_libraries": {
      "setting": ""
    },
    "session_replication_role": {
      "setting": "origin"
    },
    "shared_buffers": {
      "setting": "16384",
      "bootval": "1024",
      "source": "/Users/emanuelcalvo/Library/Application Support/Postgres/var-14/postgresql.conf:127"
    },
    "shared_memory_type": {
      "setting": "mmap"
    },
    "shared_preload_libraries": {
      "setting": ""
    },
    "ssl": {
      "setting": "off"
    },
    "ssl_ca_file": {
      "setting": ""
    },
    "ssl_cert_file": {
      "setting": "server.crt"
    },
    "ssl_ciphers": {
      "setting": "HIGH:MEDIUM:+3DES:!aNULL"
    },
    "ssl_crl_dir": {
      "setting": ""
    },
    "ssl_crl_file": {
      "setting": ""
    },
    "ssl_dh_params_file": {
      "setting": ""
    },
    "ssl_ecdh_curve": {
      "setting": "prime256v1"
    },
    "ssl_key_file": {
      "setting": "server.key"
    },
    "ssl_library": {
      "setting": "OpenSSL"
    },
    "ssl_max_protocol_version": {
      "setting": ""
    },
    "ssl_min_protocol_version": {
      "setting": "TLSv1.2"
    },
    "ssl_passphrase_command": {
      "setting": ""
    },
    "ssl_passphrase_command_supports_reload": {
      "setting": "off"
    },
    "ssl_prefer_server_ciphers": {
      "setting": "on"
    },
    "standard_conforming_strings": {
      "setting": "on"
    },
    "statement_timeout": {
      "setting": "5000",
      "bootval": "0",
      "source": "client"
    },
    "stats_temp_directory": {
      "setting": "pg_stat_tmp"
    },
    "superuser_reserved_connections": {
      "setting": "3"
    },
    "synchronize_seqscans": {
      "setting": "on"
    },
    "synchronous_commit": {
      "setting": "on"
    },
    "synchronous_standby_names": {
      "setting": ""
    },
    "syslog_facility": {
      "setting": "local0"
    },
    "syslog_ident": {
      "setting": "postgres"
    },
    "syslog_sequence_numbers": {
      "setting": "on"
    },
    "syslog_split_messages": {
      "setting": "on"
    },
    "tcp_keepalives_count": {
      "setting": "8",
      "bootval": "0",
      "source": "default"
    },
    "tcp_keepalives_idle": {
      "setting": "7200",
      "bootval": "0",
      "source": "default"
    },
    "tcp_keepalives_interval": {
      "setting": "75",
      "bootval": "0",
      "source": "default"
    },
    "tcp_user_timeout": {
      "setting": "0"
    },
    "temp_buffers": {
      "setting": "1024"
    },
    "temp_file_limit": {
      "setting": "-1"
    },
    "temp_tablespaces": {
      "setting": ""
    },
    "timezone_abbreviations": {
      "setting": "Default",
      "source": "default"
    },
    "trace_notify": {
      "setting": "off"
    },
    "trace_recovery_messages": {
      "setting": "log"
    },
    "trace_sort": {
      "setting": "off"
    },
    "track_activities": {
      "setting": "on"
    },
    "track_activity_query_size": {
      "setting": "1024"
    },
    "track_commit_timestamp": {
      "setting": "off"
    },
    "track_counts": {
      "setting": "on"
    },
    "track_functions": {
      "setting": "none"
    },
    "track_io_timing": {
      "setting": "off"
    },
    "track_wal_io_timing": {
      "setting": "off"
    },
    "transaction_deferrable": {
      "setting": "off"
    },
    "transaction_isolation": {
      "setting": "read committed"
    },
    "transaction_read_only": {
      "setting": "off"
    },
    "transform_null_equals": {
      "setting": "off"
    },
    "unix_socket_directories": {
      "setting": "/tmp"
    },
    "unix_socket_group": {
      "setting": ""
    },
    "unix_socket_permissions": {
      "setting": "0777",
      "bootval": "511",
      "source": "default"
    },
    "update_process_title": {
      "setting": "on"
    },
    "vacuum_cost_delay": {
      "setting": "0"
    },
    "vacuum_cost_limit": {
      "setting": "200"
    },
    "vacuum_cost_page_dirty": {
      "setting": "20"
    },
    "vacuum_cost_page_hit": {
      "setting": "1"
    },
    "vacuum_cost_page_miss": {
      "setting": "2"
    },
    "vacuum_defer_cleanup_age": {
      "setting": "0"
    },
    "vacuum_failsafe_age": {
      "setting": "1600000000"
    },
    "vacuum_freeze_min_age": {
      "setting": "50000000"
    },
    "vacuum_freeze_table_age": {
      "setting": "150000000"
    },
    "vacuum_multixact_failsafe_age": {
      "setting": "1600000000"
    },
    "vacuum_multixact_freeze_min_age": {
      "setting": "5000000"
    },
    "vacuum_multixact_freeze_table_age": {
      "setting": "150000000"
    },
    "wal_block_size": {
      "setting": "8192"
    },
    "wal_buffers": {
      "setting": "512",
      "bootval": "-1",
      "source": "override"
    },
    "wal_compression": {
      "setting": "off"
    },
    "wal_consistency_checking": {
      "setting": ""
    },
    "wal_init_zero": {
      "setting": "on"
    },
    "wal_keep_size": {
      "setting": "0"
    },
    "wal_level": {
      "setting": "replica"
    },
    "wal_log_hints": {
      "setting": "off"
    },
    "wal_receiver_create_temp_slot": {
      "setting": "off"
    },
    "wal_receiver_status_interval": {
      "setting": "10"
    },
    "wal_receiver_timeout": {
      "setting": "60000"
    },
    "wal_recycle": {
      "setting": "on"
    },
    "wal_retrieve_retry_interval": {
      "setting": "5000"
    },
    "wal_segment_size": {
      "setting": "16777216"
    },
    "wal_sender_timeout": {
      "setting": "60000"
    },
    "wal_skip_threshold": {
      "setting": "2048"
    },
    "wal_sync_method": {
      "setting": "open_datasync"
    },
    "wal_writer_delay": {
      "setting": "200"
    },
    "wal_writer_flush_after": {
      "setting": "128"
    },
    "work_mem": {
      "setting": "4096"
    },
    "xmlbinary": {
      "setting": "base64"
    },
    "xmloption": {
      "setting": "content"
    },
    "zero_damaged_pages": {
      "setting": "off"
    }
  },
  "locks": [
    {
      "locktype": "relation",
      "db_name": "emanuelcalvo",
      "pid": 46607,
      "mode": "AccessShareLock",
      "granted": true,
      "relation_oid": 12290
    },
    {
      "locktype": "virtualxid",
      "pid": 46607,
      "mode": "ExclusiveLock",
      "granted": true
    },
    {
      "locktype": "relation",
      "pid": 46607,
      "mode": "AccessShareLock",
      "granted": true,
      "relation_oid": 1262
    },
    {
      "locktype": "relation",
      "pid": 46607,
      "mode": "AccessShareLock",
      "granted": true,
      "relation_oid": 2671
    },
    {
      "locktype": "relation",
      "pid": 46607,
      "mode": "AccessShareLock",
      "granted": true,
      "relation_oid": 2672
    }
  ],
  "highwal": 29763,
  "betypecounts": {
    "autovacuum launcher": 1,
    "background writer": 1,
    "checkpointer": 1,
    "client backend": 2,
    "logical replication launcher": 1,
    "walwriter": 1
  }
}
