{
  "name": "promaspecticon",
  "css_prefix_text": "icon-",
  "css_use_suffix": false,
  "hinting": true,
  "units_per_em": 1000,
  "ascent": 850,
  "glyphs": [
    {
      "uid": "200272d7aa9b3aab9cb4a2eee1f624ae",
      "css": "img-phonenumber",
      "code": 59392,
      "src": "custom_icons",
      "selected": true,
      "svg": {
        "path": "M902 681.9L760.6 665.8C744 663.8 727.1 665.7 711.3 671.2 695.5 676.7 681.2 685.7 669.3 697.5L604.2 760.4C446.1 680 320 553.9 239.6 395.8L303 330.1C327 306.2 338.7 272.8 334.8 238.8L318.6 98.5C315.5 71.4 302.4 46.3 282 28.2 261.6 10 235.2 0 207.8 0H111.5C48.6 0-3.7 52.3 0.2 115.2 29.7 590.6 409.9 970.3 884.8 999.8 947.7 1003.7 1000 951.4 1000 888.5V792.1C1000.6 735.9 958.2 688.6 902 681.9Z",
        "width": 1000
      },
      "search": [
        "img-phonenumber"
      ]
    },
    {
      "uid": "067922921e0c7443ab48cfa94c14a91b",
      "css": "arrow-toright",
      "code": 59393,
      "src": "custom_icons",
      "selected": true,
      "svg": {
        "path": "M4037.5 537.5L3637.5 937.5C3612.5 962.5 3575 962.5 3550 937.5 3525 912.5 3525 875 3550 850L3837.5 562.5H0V437.5H3850L3562.5 150C3537.5 125 3537.5 87.5 3562.5 62.5 3587.5 37.5 3625 37.5 3650 62.5L4050 462.5C4062.5 475 4062.5 525 4037.5 537.5Z",
        "width": 4125
      },
      "search": [
        "arrow-toright"
      ]
    },
    {
      "uid": "4dcb621195760dda2ccb9e9126f121bd",
      "css": "btn-close",
      "code": 59395,
      "src": "custom_icons",
      "selected": true,
      "svg": {
        "path": "M961.5 38.5L38.5 961.5M38.5 38.5L961.5 961.5",
        "width": 1000
      },
      "search": [
        "btn-close"
      ]
    },
    {
      "uid": "79950a9614fc64f903be751cc3f4b9e4",
      "css": "btn-facebook",
      "code": 59396,
      "src": "custom_icons",
      "selected": true,
      "svg": {
        "path": "M125 0H875C943.9 0 1000 56.1 1000 125V875C1000 943.9 943.9 1000 875 1000H687.5V656.3H781.3L843.8 500H687.5V375C687.5 343.3 711.2 343.5 741.8 343.7 744.5 343.7 747.2 343.8 750 343.8H812.5V187.5H687.5C583.9 187.5 500 271.4 500 375V500H375V656.3H500V1000H125C56.1 1000 0 943.9 0 875V125C0 56.1 56.1 0 125 0Z",
        "width": 1000
      },
      "search": [
        "btn-facebook"
      ]
    },
    {
      "uid": "0928cf333b377853414007149ac1fd09",
      "css": "btn-linkedin",
      "code": 59400,
      "src": "custom_icons",
      "selected": true,
      "svg": {
        "path": "M748.6 0H250.6C112.6 0 0 112.7 0 250.8V750C0 887.3 112.6 1000 250.6 1000H749.4C887.4 1000 1000 887.3 1000 749.2V250.8C999.2 112.7 886.6 0 748.6 0ZM333.1 809.5H190.3V396.8H333.1V809.5ZM260.9 333.3C220.5 333.3 187.9 300.8 187.9 260.3 187.9 219.8 220.5 187.3 260.9 187.3 301.3 187.3 333.9 219.8 333.9 260.3 333.1 300.8 300.6 333.3 260.9 333.3ZM809.7 809.5H808.9 689.9V609.5C689.9 561.1 683.6 499.2 617.8 499.2 550.4 499.2 539.3 551.6 539.3 606.4V809.5H420.3V396.8H531.3V452.4H534.5C551.9 420.6 592.4 396 655.8 396 786.7 396 809.7 471.4 809.7 583.3V809.5Z",
        "width": 1000
      },
      "search": [
        "btn-linkedin"
      ]
    },
    {
      "uid": "721f7558d7f664359c8afafe76dc775a",
      "css": "img-contactmail",
      "code": 59401,
      "src": "custom_icons",
      "selected": true,
      "svg": {
        "path": "M125 1000H875C943.9 1000 1000 946.8 1000 881.4V305.5C1000 293.6 993.4 282.6 982.9 276.5L514.3 4.9C502.7-1.7 488.2-1.7 476.8 5.1L16.8 276.7C6.4 282.9 0 293.8 0 305.5V881.4C0 946.8 56.1 1000 125 1000ZM495.9 552.1L846.6 353.2V432.2L495.9 631 151.1 435.4V356.4L495.9 552.1Z",
        "width": 1000
      },
      "search": [
        "img-contactmail"
      ]
    },
    {
      "uid": "5955069571c4b86565688854c7568b62",
      "css": "btn-google",
      "code": 59402,
      "src": "custom_icons",
      "selected": true,
      "svg": {
        "path": "M791.7 0H208.3C91.7 0 0 91.7 0 208.3V791.7C0 908.3 91.7 1000 208.3 1000H791.7C908.3 1000 1000 908.3 1000 791.7V208.3C1000 91.7 908.3 0 791.7 0ZM641.7 500C641.7 529.2 637.5 554.2 629.2 579.2 591.7 700 479.2 791.7 341.7 791.7 175 791.7 41.7 662.5 41.7 500S175 208.3 341.7 208.3C433.3 208.3 520.8 254.2 566.7 312.5L491.7 387.5C462.5 345.8 404.2 312.5 341.7 312.5 237.5 312.5 145.8 391.7 145.8 495.8S233.3 683.3 337.5 683.3C412.5 683.3 479.2 641.7 508.3 579.2H366.7V475H641.7V500ZM958.3 558.3H875V645.8H766.7V558.3H683.3V441.7H766.7V354.2H875V441.7H958.3V558.3Z",
        "width": 1000
      },
      "search": [
        "btn-google"
      ]
    },
    {
      "uid": "898ba889de6e12f825e2ec994e8e4eef",
      "css": "img-locationpoint",
      "code": 59403,
      "src": "custom_icons",
      "selected": true,
      "svg": {
        "path": "M428.6 0C192.9 0 0 187.5 0 417.9 0 642.9 389.3 967.9 407.1 982.1L430.4 1000 453.6 982.1 453.6 982.1C473.2 962.5 857.1 639.3 857.1 417.9 857.1 187.5 664.3 0 428.6 0ZM428.6 625C310.7 625 214.3 528.6 214.3 410.7S310.7 196.4 428.6 196.4 642.9 292.9 642.9 410.7 546.4 625 428.6 625Z",
        "width": 857
      },
      "search": [
        "img-locationpoint"
      ]
    },
    {
      "uid": "34f2d8e552a447dd35644668f2deeb81",
      "css": "btn-gotoup",
      "code": 59406,
      "src": "custom_icons",
      "selected": true,
      "svg": {
        "path": "M0 0V1000H1000V0H0ZM677.5 490C667.5 500 652.5 500 642.5 490L525 372.5V687.5H475V372.5L357.5 490C347.5 500 332.5 500 322.5 490S312.5 465 322.5 455L482.5 295C492.5 285 507.5 285 517.5 295L677.5 455C687.5 462.5 687.5 480 677.5 490Z",
        "width": 1000
      },
      "search": [
        "btn-gotoup"
      ]
    },
    {
      "uid": "fed4e25863176542996ce25b36504eea",
      "css": "btn-chech",
      "code": 59397,
      "src": "custom_icons",
      "selected": true,
      "svg": {
        "path": "M625 937.5C612.5 937.5 587.5 937.5 575 925L75 425C50 400 50 362.5 75 337.5S137.5 312.5 162.5 337.5L625 787.5 1325 87.5C1350 62.5 1387.5 62.5 1412.5 87.5S1437.5 150 1412.5 175L662.5 925C662.5 937.5 637.5 937.5 625 937.5Z",
        "width": 1500
      },
      "search": [
        "btn-chech"
      ]
    },
    {
      "uid": "21703b39db13bfb6e0e23a2e2ffc8476",
      "css": "btn-instagram",
      "code": 59405,
      "src": "custom_icons",
      "selected": true,
      "svg": {
        "path": "M1000 216.7C991.7 91.7 912.5 20.8 812.5 4.2L812.5 4.2C787.5 4.2 779.2 0 662.5 0 591.7 0 525 0 470.8 0 208.3 0 133.3 0 66.7 70.8 0 137.5 0 208.3 0 387.5 0 420.8 0 458.3 0 500 0 529.2 0 562.5 0 591.7-4.2 775-8.3 945.8 162.5 987.5 225 1004.2 775 1004.2 837.5 987.5 920.8 966.7 987.5 900 995.8 783.3 1000 766.7 1000 233.3 1000 216.7ZM870.8 462.5V537.5C870.8 625 870.8 691.7 850 741.7 800 870.8 670.8 870.8 537.5 870.8 525 870.8 512.5 870.8 500 870.8S475 870.8 462.5 870.8C325 870.8 200 870.8 150 741.7 129.2 691.7 129.2 612.5 129.2 529.2V462.5C129.2 375 129.2 308.3 150 258.3 200 129.2 325 129.2 462.5 129.2 475 129.2 487.5 129.2 500 129.2H500C512.5 129.2 529.2 129.2 541.7 129.2 658.3 129.2 741.7 129.2 808.3 191.7 875 258.3 875 341.7 870.8 462.5ZM529.2 200C508.3 200 491.7 200 470.8 200 345.8 200 279.2 200 245.8 241.7 208.3 279.2 204.2 354.2 204.2 504.2 204.2 800 212.5 808.3 508.3 808.3 525 808.3 537.5 808.3 550 808.3 691.7 808.3 800 812.5 808.3 654.2 825 195.8 791.7 195.8 529.2 200ZM504.2 691.7C400 691.7 316.7 608.3 316.7 500 316.7 395.8 400 312.5 504.2 312.5S691.7 395.8 691.7 500C691.7 604.2 608.3 691.7 504.2 691.7ZM700 350C675 350 654.2 329.2 654.2 304.2S675 258.3 700 258.3C725 258.3 745.8 279.2 745.8 304.2S725 350 700 350ZM504.2 625C341.7 625 341.7 379.2 504.2 379.2 666.7 379.2 666.7 625 504.2 625Z",
        "width": 1000
      },
      "search": [
        "btn-instagram"
      ]
    },
    {
      "uid": "f8f12624a6dda9f9ab8c57df945cd6df",
      "css": "btn-callback",
      "code": 59394,
      "src": "custom_icons",
      "selected": true,
      "svg": {
        "path": "M864.1 695.3L732.8 679.7C717.2 679.7 701.6 679.7 684.4 684.4 668.8 689.1 656.3 696.9 643.7 707.8L543.8 807.8C392.2 731.3 267.2 607.8 192.2 456.2L292.2 356.2C315.6 332.8 328.1 300 323.4 268.7L307.8 132.8C303.1 104.7 292.2 81.2 271.9 64.1 251.6 48.4 223.4 40.6 200 40.6H107.8C48.4 40.6-3.1 92.2 0 151.6 28.1 607.8 392.2 971.9 848.4 1000 907.8 1004.7 960.9 951.6 960.9 892.2V800C959.4 748.4 920.3 700 864.1 695.3ZM820.3 520.3H779.7C779.7 356.2 643.8 220.3 479.7 220.3V179.7C668.8 179.7 820.3 331.3 820.3 520.3ZM1000 520.3H920.3C920.3 276.6 725 79.7 479.7 79.7V0C768.8 0 1000 231.3 1000 520.3Z",
        "width": 1000
      },
      "search": [
        "btn-callback"
      ]
    }
  ]
}