
{
    "error": null,
    "data": [
        {
            "id": 1,
            "name": "Kallakurichi",
            "description": "Kallakurichi description",
            "long_description": "Kallakurichi long description",
            "address": {
                "area" : "",
                "district": "",
                "pincode": ""
            },
            "location": {
                "latitiude": 23.0000023,
                "longitude": 54.94994329
            },
            "category": [
                "Fort", "Dam"
            ], 
            "images" : [
                {
                    "type": "VR", 
                    "url": "https://upload.wikimedia.org/wikipedia/commons/thumb/c/c6/Glory_Of_Viluppuram_2.jpg/250px-Glory_Of_Viluppuram_2.jpg",
                    "description": ""
                },
                {
                    "type": "360", 
                    "url": "https://upload.wikimedia.org/wikipedia/commons/thumb/c/c6/Glory_Of_Viluppuram_2.jpg/250px-Glory_Of_Viluppuram_2.jpg",
                    "description": ""
                }
            ],
            "videos" : [
                {
                    "type": "youtube", 
                    "url": "https://upload.wikimedia.org/wikipedia/commons/thumb/c/c6/Glory_Of_Viluppuram_2.jpg/250px-Glory_Of_Viluppuram_2.jpg",
                    "description": ""
                },
                {
                    "type": "mp4", 
                    "url": "https://upload.wikimedia.org/wikipedia/commons/thumb/c/c6/Glory_Of_Viluppuram_2.jpg/250px-Glory_Of_Viluppuram_2.jpg",
                    "description": ""
                }
            ]
        }
    ]
}
