{
	"info": {
		"_postman_id": "0af9db30-bbc2-4f30-be8c-6d1fea171175",
		"name": "HealthyFood_RegisteredUser",
		"schema": "https://schema.getpostman.com/json/collection/v2.1.0/collection.json"
	},
	"item": [
		{
			"name": "Users",
			"item": [
				{
					"name": "Login",
					"event": [
						{
							"listen": "test",
							"script": {
								"id": "866615c3-6e15-4170-941c-92c0b4ab3503",
								"exec": [
									"pm.collectionVariables.set(\"SesionCookie\", pm.cookies.get('JSESSIONID'));\r",
									"\r",
									"console.log(pm.cookies.get('JSESSIONID'));"
								],
								"type": "text/javascript"
							}
						}
					],
					"request": {
						"method": "POST",
						"header": [],
						"body": {
							"mode": "formdata",
							"formdata": [
								{
									"key": "username",
									"value": "{{userUsername2}}",
									"type": "text"
								},
								{
									"key": "password",
									"value": "{{userPassword2}}",
									"type": "text"
								}
							]
						},
						"url": {
							"raw": "{{baseURL}}/authenticate",
							"host": [
								"{{baseURL}}"
							],
							"path": [
								"authenticate"
							]
						}
					},
					"response": []
				},
				{
					"name": "GetUsers",
					"event": [
						{
							"listen": "test",
							"script": {
								"id": "2edfada5-2593-4341-afc5-71c423544b2a",
								"exec": [
									""
								],
								"type": "text/javascript"
							}
						}
					],
					"protocolProfileBehavior": {
						"disableBodyPruning": true
					},
					"request": {
						"method": "GET",
						"header": [
							{
								"key": "Cookie",
								"value": "{{cookie}}",
								"type": "text"
							}
						],
						"body": {
							"mode": "formdata",
							"formdata": [],
							"options": {
								"formdata": {}
							}
						},
						"url": {
							"raw": "{{baseURL}}/api/v1/users",
							"host": [
								"{{baseURL}}"
							],
							"path": [
								"api",
								"v1",
								"users"
							]
						}
					},
					"response": []
				},
				{
					"name": "GetUserByID",
					"event": [
						{
							"listen": "test",
							"script": {
								"id": "e75d396e-debb-4e2d-ad56-2baf97aed1f0",
								"exec": [
									"pm.test(\"User ID\", function () {\r",
									"    \r",
									"    var jsonData = pm.response.json();\r",
									"    var userid = pm.collectionVariables.get(\"userID\");\r",
									"\r",
									"    pm.expect(jsonData.id).to.eql(userid);\r",
									"});"
								],
								"type": "text/javascript"
							}
						},
						{
							"listen": "prerequest",
							"script": {
								"id": "843c0e37-d4d8-4e2c-a51a-6f55a57f4b2d",
								"exec": [
									"pm.collectionVariables.set(\"userID\", 7)"
								],
								"type": "text/javascript"
							}
						}
					],
					"request": {
						"method": "GET",
						"header": [
							{
								"key": "Cookie",
								"value": "{{cookie}}",
								"type": "text"
							}
						],
						"url": {
							"raw": "{{baseURL}}/api/v1/users/{{userID}}",
							"host": [
								"{{baseURL}}"
							],
							"path": [
								"api",
								"v1",
								"users",
								"{{userID}}"
							]
						}
					},
					"response": []
				},
				{
					"name": "UpdateUserInfo",
					"event": [
						{
							"listen": "test",
							"script": {
								"id": "69e93715-2c5e-40c5-ac26-a76eba682769",
								"exec": [
									"pm.test(\"Updated user ID\", function () {\r",
									"    \r",
									"    var jsonData = pm.response.json();\r",
									"    var userid = pm.collectionVariables.get(\"userID\");\r",
									"\r",
									"    pm.expect(jsonData.id).to.eql(userid);\r",
									"});\r",
									"\r",
									"pm.test(\"Updated User First Name\", function () {\r",
									"    var jsonData = pm.response.json();\r",
									"    pm.expect(jsonData.firstName).to.eql(\"Changed\");\r",
									"});"
								],
								"type": "text/javascript"
							}
						}
					],
					"request": {
						"method": "PUT",
						"header": [
							{
								"key": "Cookie",
								"value": "{{cookie}}",
								"type": "text"
							}
						],
						"body": {
							"mode": "formdata",
							"formdata": [
								{
									"key": "user",
									"type": "file",
									"src": "DataFormFiles/userUpdate _registeredUser.json"
								}
							],
							"options": {
								"formdata": {}
							}
						},
						"url": {
							"raw": "{{baseURL}}/api/v1/users/{{userID}}",
							"host": [
								"{{baseURL}}"
							],
							"path": [
								"api",
								"v1",
								"users",
								"{{userID}}"
							]
						}
					},
					"response": []
				},
				{
					"name": "ResetUpdatedUserInfo",
					"event": [
						{
							"listen": "test",
							"script": {
								"id": "15c083a0-c815-4308-b6ab-d11ca05175f9",
								"exec": [
									"pm.test(\"Reset of Updated User Name\", function () {\r",
									"    var jsonData = pm.response.json();\r",
									"    pm.expect(jsonData.firstName).to.eql(\"Test\");\r",
									"});"
								],
								"type": "text/javascript"
							}
						}
					],
					"request": {
						"method": "PUT",
						"header": [
							{
								"key": "Cookie",
								"value": "{{cookie}}",
								"type": "text"
							}
						],
						"body": {
							"mode": "formdata",
							"formdata": [
								{
									"key": "user",
									"type": "file",
									"src": "DataFormFiles/registeredUser .json"
								}
							],
							"options": {
								"formdata": {}
							}
						},
						"url": {
							"raw": "{{baseURL}}/api/v1/users/{{userID}}",
							"host": [
								"{{baseURL}}"
							],
							"path": [
								"api",
								"v1",
								"users",
								"{{userID}}"
							]
						}
					},
					"response": []
				},
				{
					"name": "Logout",
					"request": {
						"method": "GET",
						"header": [],
						"url": {
							"raw": "{{baseURL}}/logout",
							"host": [
								"{{baseURL}}"
							],
							"path": [
								"logout"
							]
						}
					},
					"response": []
				}
			],
			"event": [
				{
					"listen": "prerequest",
					"script": {
						"id": "70dc09c9-7423-4ad3-ae01-00c583607f33",
						"type": "text/javascript",
						"exec": [
							""
						]
					}
				},
				{
					"listen": "test",
					"script": {
						"id": "c7ef3115-d0e2-416c-9630-a2b39b19ea18",
						"type": "text/javascript",
						"exec": [
							"pm.test(\"Status code is 200\", function () {",
							"    pm.response.to.have.status(200);",
							"});"
						]
					}
				}
			],
			"protocolProfileBehavior": {}
		},
		{
			"name": "PostAndComment",
			"item": [
				{
					"name": "Login",
					"event": [
						{
							"listen": "test",
							"script": {
								"id": "f3ab0da9-2132-474d-824c-de4a3da4b273",
								"exec": [
									"pm.collectionVariables.set(\"SesionCookie\", pm.cookies.get('JSESSIONID'));\r",
									"\r",
									"console.log(pm.cookies.get('JSESSIONID'));"
								],
								"type": "text/javascript"
							}
						}
					],
					"request": {
						"method": "POST",
						"header": [],
						"body": {
							"mode": "formdata",
							"formdata": [
								{
									"key": "username",
									"value": "{{userUsername2}}",
									"type": "text"
								},
								{
									"key": "password",
									"value": "{{userPassword2}}",
									"type": "text"
								}
							]
						},
						"url": {
							"raw": "{{baseURL}}/authenticate",
							"host": [
								"{{baseURL}}"
							],
							"path": [
								"authenticate"
							]
						}
					},
					"response": []
				},
				{
					"name": "PublicPosts",
					"request": {
						"method": "GET",
						"header": [
							{
								"key": "Cookie",
								"value": "{{cookie}}",
								"type": "text"
							}
						],
						"url": {
							"raw": "{{baseURL}}/posts",
							"host": [
								"{{baseURL}}"
							],
							"path": [
								"posts"
							]
						}
					},
					"response": []
				},
				{
					"name": "AllPostsOfFriends",
					"event": [
						{
							"listen": "test",
							"script": {
								"id": "5204c765-3239-4533-a7c1-ce494aa9ddf7",
								"exec": [
									""
								],
								"type": "text/javascript"
							}
						}
					],
					"request": {
						"method": "GET",
						"header": [
							{
								"key": "Cookie",
								"value": "{{cookie}}",
								"type": "text"
							}
						],
						"url": {
							"raw": "{{baseURL}}/posts/connected",
							"host": [
								"{{baseURL}}"
							],
							"path": [
								"posts",
								"connected"
							]
						}
					},
					"response": []
				},
				{
					"name": "Top3Posts",
					"event": [
						{
							"listen": "test",
							"script": {
								"id": "f5062981-b29f-40ff-98ab-259d753c4e96",
								"exec": [
									"pm.test(\"List of top 3 posts to include postID = 1\", function () {\r",
									"\r",
									"    var jsonData = pm.response.json();\r",
									"\r",
									"    pm.expect(Array.isArray(jsonData));\r",
									"\r",
									"    let hasOne = false;\r",
									"\r",
									"    jsonData.forEach((obj) => {\r",
									"        pm.expect(typeof obj.id).to.not.eql(\"undefined\");\r",
									"\r",
									"        hasOne = obj.id === 1 || hasOne;\r",
									"    })\r",
									"\r",
									"    pm.expect(hasOne);\r",
									"});\r",
									"\r",
									"pm.test(\"List of top 3 posts are 3 of number\", function () {\r",
									"\r",
									"   let objects = pm.response.json();\r",
									"\r",
									"    let count = 0;\r",
									"    while (objects[count]!=null) {\r",
									"        count++;}\r",
									"\r",
									"    pm.collectionVariables.set(\"top3PostCount\", count);\r",
									"    console.log(pm.collectionVariables.get(\"top3PostCount\"))\r",
									"\r",
									"    pm.expect(\"top3PostCount\", 3);\r",
									"});\r",
									""
								],
								"type": "text/javascript"
							}
						}
					],
					"request": {
						"method": "GET",
						"header": [
							{
								"key": "Cookie",
								"value": "{{cookie}}",
								"type": "text"
							}
						],
						"url": {
							"raw": "{{baseURL}}/api/v1/posts/top",
							"host": [
								"{{baseURL}}"
							],
							"path": [
								"api",
								"v1",
								"posts",
								"top"
							]
						}
					},
					"response": []
				},
				{
					"name": "CreatePost",
					"event": [
						{
							"listen": "test",
							"script": {
								"id": "13fc52a1-0ccb-440e-870e-39cff2238440",
								"exec": [
									"pm.collectionVariables.set(\"postID\", pm.response.json().id);\r",
									"\r",
									"pm.test(\"Post created Title\", function () {\r",
									"    var jsonData = pm.response.json();\r",
									"    pm.expect(jsonData.title).to.eql(\"PostmanPost\");\r",
									"});\r",
									"\r",
									"pm.test(\"Post created ID\", function () {\r",
									"    var jsonData = pm.response.json();\r",
									"    pm.expect(jsonData.id).to.eql(pm.collectionVariables.get(\"postID\"));\r",
									"});"
								],
								"type": "text/javascript"
							}
						}
					],
					"request": {
						"method": "POST",
						"header": [
							{
								"key": "Cookie",
								"value": "{{cookie}}",
								"type": "text"
							}
						],
						"body": {
							"mode": "formdata",
							"formdata": [
								{
									"key": "post",
									"type": "file",
									"src": "DataFormFiles/post.json"
								}
							],
							"options": {
								"formdata": {}
							}
						},
						"url": {
							"raw": "{{baseURL}}/api/v1/posts",
							"host": [
								"{{baseURL}}"
							],
							"path": [
								"api",
								"v1",
								"posts"
							],
							"query": [
								{
									"key": "post",
									"value": "",
									"disabled": true
								}
							]
						}
					},
					"response": []
				},
				{
					"name": "AllMyPosts",
					"event": [
						{
							"listen": "test",
							"script": {
								"id": "5d40c983-7a1b-40ce-b5bd-cf3915b4e7b3",
								"exec": [
									"pm.test(\"Post ID is in list of all my posts\", function () {\r",
									"\r",
									"    var postid = pm.collectionVariables.get(\"postID\");\r",
									"    var jsonData = pm.response.json();\r",
									"\r",
									"    pm.expect(Array.isArray(jsonData));\r",
									"\r",
									"    let myPostID = false;\r",
									"\r",
									"    jsonData.forEach((obj) => {\r",
									"        pm.expect(typeof obj.id).to.not.eql(\"undefined\");\r",
									"\r",
									"        myPostID = obj.id === postid || myPostID;\r",
									"    })\r",
									"\r",
									"    pm.expect(myPostID);\r",
									"});"
								],
								"type": "text/javascript"
							}
						}
					],
					"request": {
						"method": "GET",
						"header": [
							{
								"key": "Cookie",
								"value": "{{cookie}}",
								"type": "text"
							}
						],
						"url": {
							"raw": "{{baseURL}}/api/v1/posts/my?page=1&size=1",
							"host": [
								"{{baseURL}}"
							],
							"path": [
								"api",
								"v1",
								"posts",
								"my"
							],
							"query": [
								{
									"key": "page",
									"value": "1"
								},
								{
									"key": "size",
									"value": "1"
								}
							]
						}
					},
					"response": []
				},
				{
					"name": "Get Post by ID",
					"event": [
						{
							"listen": "test",
							"script": {
								"id": "83f09a40-0225-492c-9ecb-d23077f90da6",
								"exec": [
									"pm.test(\"Check post by ID\", function () {\r",
									"    var jsonData = pm.response.json();\r",
									"    pm.expect(jsonData.id).to.eql(pm.collectionVariables.get(\"postID\"));\r",
									"});\r",
									"\r",
									"pm.test(\"Check if post has correct title\", function () {\r",
									"    var jsonData = pm.response.json();\r",
									"    pm.expect(jsonData.title).to.eql(\"PostmanPost\");\r",
									"});"
								],
								"type": "text/javascript"
							}
						}
					],
					"protocolProfileBehavior": {
						"disableBodyPruning": true
					},
					"request": {
						"method": "GET",
						"header": [
							{
								"key": "Cookie",
								"value": "{{cookie}}",
								"type": "text"
							}
						],
						"body": {
							"mode": "formdata",
							"formdata": [
								{
									"key": "post",
									"type": "file",
									"src": "/G:/QA/FinalProject/final-qa-project/Output/Postman/post.json"
								}
							],
							"options": {
								"formdata": {}
							}
						},
						"url": {
							"raw": "{{baseURL}}/api/v1/posts/{{postID}}",
							"host": [
								"{{baseURL}}"
							],
							"path": [
								"api",
								"v1",
								"posts",
								"{{postID}}"
							]
						}
					},
					"response": []
				},
				{
					"name": "UpdatePost",
					"event": [
						{
							"listen": "test",
							"script": {
								"id": "5b97a4b4-1da4-45b7-af09-4a381ce1dd49",
								"exec": [
									"pm.test(\"Updated post ID\", function () {\r",
									"    var jsonData = pm.response.json();\r",
									"    pm.expect(jsonData.id).to.eql(pm.collectionVariables.get(\"postID\"));\r",
									"});\r",
									"\r",
									"pm.test(\"Post title is updated\", function () {\r",
									"    var jsonData = pm.response.json();\r",
									"    pm.expect(jsonData.title).to.eql(\"Updated\");\r",
									"});"
								],
								"type": "text/javascript"
							}
						}
					],
					"request": {
						"method": "PUT",
						"header": [
							{
								"key": "Cookie",
								"value": "{{cookie}}",
								"type": "text"
							}
						],
						"body": {
							"mode": "formdata",
							"formdata": [
								{
									"key": "post",
									"type": "file",
									"src": "DataFormFiles/updatePost.json"
								}
							],
							"options": {
								"formdata": {}
							}
						},
						"url": {
							"raw": "{{baseURL}}/api/v1/posts/{{postID}}",
							"host": [
								"{{baseURL}}"
							],
							"path": [
								"api",
								"v1",
								"posts",
								"{{postID}}"
							]
						}
					},
					"response": []
				},
				{
					"name": "AllLikesOfThePost",
					"event": [
						{
							"listen": "test",
							"script": {
								"id": "f16df690-e73a-47e3-881f-51bca448954e",
								"exec": [
									"pm.collectionVariables.set(\"postLikes\", pm.response.json())\r",
									"console.log(pm.collectionVariables.get(\"postLikes\"))\r",
									"\r",
									"pm.test(\"Post has no likes\", function () {\r",
									"    var jsonData = pm.response.json();\r",
									"    pm.expect(jsonData).to.eql(0);\r",
									"});"
								],
								"type": "text/javascript"
							}
						}
					],
					"request": {
						"method": "GET",
						"header": [
							{
								"key": "Cookie",
								"value": "{{cookie}}",
								"type": "text"
							}
						],
						"url": {
							"raw": "{{baseURL}}/api/v1/posts/{{postID}}/likes",
							"host": [
								"{{baseURL}}"
							],
							"path": [
								"api",
								"v1",
								"posts",
								"{{postID}}",
								"likes"
							]
						}
					},
					"response": []
				},
				{
					"name": "LikePost",
					"event": [
						{
							"listen": "test",
							"script": {
								"id": "d548816d-d681-4996-8ce7-3a718529600e",
								"exec": [
									"pm.test(\"Post likes increase by 1\", function () {\r",
									"    var jsonData = pm.response.json();\r",
									"    pm.expect(jsonData).to.eql(pm.collectionVariables.get(\"postLikes\")+1);\r",
									"});"
								],
								"type": "text/javascript"
							}
						}
					],
					"request": {
						"method": "POST",
						"header": [
							{
								"key": "Cookie",
								"value": "{{cookie}}",
								"type": "text"
							}
						],
						"body": {
							"mode": "formdata",
							"formdata": [],
							"options": {
								"formdata": {}
							}
						},
						"url": {
							"raw": "{{baseURL}}/api/v1/posts/{{postID}}/likes",
							"host": [
								"{{baseURL}}"
							],
							"path": [
								"api",
								"v1",
								"posts",
								"{{postID}}",
								"likes"
							]
						}
					},
					"response": []
				},
				{
					"name": "ListAllComments",
					"event": [
						{
							"listen": "test",
							"script": {
								"id": "1541579a-5778-450c-b94c-df278e320d75",
								"exec": [
									"pm.test(\"No cooments of post\", function () {\r",
									"    var jsonData = pm.response.json();\r",
									"    pm.expect(jsonData).to.eql([]);\r",
									"});"
								],
								"type": "text/javascript"
							}
						},
						{
							"listen": "prerequest",
							"script": {
								"id": "127d2304-e0f2-4420-8645-86e09b2bfe7d",
								"exec": [
									"pm.collectionVariables.set(\"comment\", \"Comment via Postman\")"
								],
								"type": "text/javascript"
							}
						}
					],
					"request": {
						"method": "GET",
						"header": [
							{
								"key": "Cookie",
								"value": "{{cookie}}",
								"type": "text"
							}
						],
						"url": {
							"raw": "{{baseURL}}/api/v1/posts/{{postID}}/comments",
							"host": [
								"{{baseURL}}"
							],
							"path": [
								"api",
								"v1",
								"posts",
								"{{postID}}",
								"comments"
							]
						}
					},
					"response": []
				},
				{
					"name": "CreateComment",
					"event": [
						{
							"listen": "test",
							"script": {
								"id": "5b7b7046-1e1a-4229-bf55-f4350ee58d23",
								"exec": [
									"pm.collectionVariables.set(\"commentID\", pm.response.json().id);\r",
									"\r",
									"pm.test(\"Comment is created with right description\", function () {\r",
									"    var jsonData = pm.response.json();\r",
									"    var comment = pm.collectionVariables.get(\"comment\");\r",
									"\r",
									"    pm.expect(jsonData.description).to.eql(comment);\r",
									"});\r",
									""
								],
								"type": "text/javascript"
							}
						},
						{
							"listen": "prerequest",
							"script": {
								"id": "f3cb4714-3fd2-40f4-9dbf-350583a38392",
								"exec": [
									"pm.collectionVariables.set(\"comment\", \"Comment via Postman\")"
								],
								"type": "text/javascript"
							}
						}
					],
					"request": {
						"method": "POST",
						"header": [
							{
								"key": "Cookie",
								"value": "{{cookie}}",
								"type": "text"
							}
						],
						"body": {
							"mode": "raw",
							"raw": "{\r\n    \"comment\": \"{{comment}}\"\r\n}",
							"options": {
								"raw": {
									"language": "json"
								}
							}
						},
						"url": {
							"raw": "{{baseURL}}/api/v1/posts/{{postID}}/comments",
							"host": [
								"{{baseURL}}"
							],
							"path": [
								"api",
								"v1",
								"posts",
								"{{postID}}",
								"comments"
							]
						}
					},
					"response": []
				},
				{
					"name": "GetComentByID",
					"event": [
						{
							"listen": "test",
							"script": {
								"id": "755fac02-56e0-4152-9450-d7840ae46915",
								"exec": [
									"pm.test(\"Check Comment description by ID\", function () {\r",
									"    var jsonData = pm.response.json();\r",
									"    var comment = pm.collectionVariables.get(\"comment\");\r",
									"\r",
									"    pm.expect(jsonData.description).to.eql(comment);\r",
									"});\r",
									"\r",
									"pm.test(\"Check Comment ID\", function () {\r",
									"    var jsonData = pm.response.json();\r",
									"    var commentid = pm.collectionVariables.get(\"commentID\");\r",
									"\r",
									"    pm.expect(jsonData.id).to.eql(commentid);\r",
									"});"
								],
								"type": "text/javascript"
							}
						},
						{
							"listen": "prerequest",
							"script": {
								"id": "b3eb22cc-7d39-4c35-9516-7f52ef758418",
								"exec": [
									""
								],
								"type": "text/javascript"
							}
						}
					],
					"request": {
						"method": "GET",
						"header": [
							{
								"key": "Cookie",
								"value": "{{cookie}}",
								"type": "text"
							}
						],
						"url": {
							"raw": "{{baseURL}}/api/v1/comments/{{commentID}}",
							"host": [
								"{{baseURL}}"
							],
							"path": [
								"api",
								"v1",
								"comments",
								"{{commentID}}"
							]
						}
					},
					"response": []
				},
				{
					"name": "ListLast5Comments",
					"event": [
						{
							"listen": "test",
							"script": {
								"id": "d76ef59e-8e63-49e9-9017-cf7c651f34e2",
								"exec": [
									"pm.test(\"Comment is in last 5 comments\", function () {\r",
									"    var jsonData = pm.response.text();\r",
									"    var comment = pm.collectionVariables.get(\"comment\");\r",
									"\r",
									"    pm.expect(jsonData).to.include(comment);\r",
									"});"
								],
								"type": "text/javascript"
							}
						},
						{
							"listen": "prerequest",
							"script": {
								"id": "099284a9-ef45-4a8a-8671-9a36466a60f6",
								"exec": [
									""
								],
								"type": "text/javascript"
							}
						}
					],
					"request": {
						"method": "GET",
						"header": [
							{
								"key": "Cookie",
								"value": "{{cookie}}",
								"type": "text"
							}
						],
						"url": {
							"raw": "{{baseURL}}/api/v1/posts/{{postID}}/latest_comments",
							"host": [
								"{{baseURL}}"
							],
							"path": [
								"api",
								"v1",
								"posts",
								"{{postID}}",
								"latest_comments"
							]
						}
					},
					"response": []
				},
				{
					"name": "UpdateComment",
					"event": [
						{
							"listen": "test",
							"script": {
								"id": "370b8426-0bf3-4203-82df-e0d23dea5c2a",
								"exec": [
									"pm.test(\"Comment description is updated\", function () {\r",
									"    var jsonData = pm.response.json();\r",
									"    var comment = pm.collectionVariables.get(\"comment\");\r",
									"\r",
									"    pm.expect(jsonData.description).to.eql(comment);\r",
									"});\r",
									"\r",
									"pm.test(\"Check Updated Comment ID\", function () {\r",
									"    var jsonData = pm.response.json();\r",
									"    var commentid = pm.collectionVariables.get(\"commentID\");\r",
									"\r",
									"    pm.expect(jsonData.id).to.eql(commentid);\r",
									"});"
								],
								"type": "text/javascript"
							}
						},
						{
							"listen": "prerequest",
							"script": {
								"id": "dcc80df8-582d-4742-a5ce-27ede5c05082",
								"exec": [
									"pm.collectionVariables.set(\"comment\", \"Updated Comment\")"
								],
								"type": "text/javascript"
							}
						}
					],
					"request": {
						"method": "PUT",
						"header": [
							{
								"key": "Cookie",
								"value": "{{cookie}}",
								"type": "text"
							}
						],
						"body": {
							"mode": "raw",
							"raw": "{\r\n    \"comment\": \"{{comment}}\"\r\n}",
							"options": {
								"raw": {
									"language": "json"
								}
							}
						},
						"url": {
							"raw": "{{baseURL}}/api/v1/comments/{{commentID}}",
							"host": [
								"{{baseURL}}"
							],
							"path": [
								"api",
								"v1",
								"comments",
								"{{commentID}}"
							]
						}
					},
					"response": []
				},
				{
					"name": "CommentLikes",
					"event": [
						{
							"listen": "test",
							"script": {
								"id": "d0038d03-f497-405b-94be-c22c6a9f9765",
								"exec": [
									"pm.collectionVariables.set(\"commentLikes\", pm.response.json())\r",
									"\r",
									"pm.test(\"Comment has no likes\", function () {\r",
									"    var jsonData = pm.response.json();\r",
									"    pm.expect(jsonData).to.eql(0);\r",
									"});"
								],
								"type": "text/javascript"
							}
						},
						{
							"listen": "prerequest",
							"script": {
								"id": "aea94b3f-1486-44f0-8adb-c3af803c9a28",
								"exec": [
									""
								],
								"type": "text/javascript"
							}
						}
					],
					"protocolProfileBehavior": {
						"disableBodyPruning": true
					},
					"request": {
						"method": "GET",
						"header": [
							{
								"key": "Cookie",
								"value": "{{cookie}}",
								"type": "text"
							}
						],
						"body": {
							"mode": "raw",
							"raw": "",
							"options": {
								"raw": {
									"language": "json"
								}
							}
						},
						"url": {
							"raw": "{{baseURL}}/api/v1/comments/{{commentID}}/likes",
							"host": [
								"{{baseURL}}"
							],
							"path": [
								"api",
								"v1",
								"comments",
								"{{commentID}}",
								"likes"
							]
						}
					},
					"response": []
				},
				{
					"name": "LikeComment",
					"event": [
						{
							"listen": "test",
							"script": {
								"id": "125f9ba9-d393-4b39-9287-5aa537f25b86",
								"exec": [
									"pm.test(\"Comment likes increased by 1\", function () {\r",
									"    var jsonData = pm.response.json();\r",
									"    pm.expect(jsonData).to.eql(pm.collectionVariables.get(\"commentLikes\")+1);\r",
									"});"
								],
								"type": "text/javascript"
							}
						},
						{
							"listen": "prerequest",
							"script": {
								"id": "adaf0f55-e0ec-40db-86c8-21c10ad7f4e5",
								"exec": [
									""
								],
								"type": "text/javascript"
							}
						}
					],
					"request": {
						"method": "POST",
						"header": [
							{
								"key": "Cookie",
								"value": "{{cookie}}",
								"type": "text"
							}
						],
						"body": {
							"mode": "raw",
							"raw": "",
							"options": {
								"raw": {
									"language": "json"
								}
							}
						},
						"url": {
							"raw": "{{baseURL}}/api/v1/comments/{{commentID}}/likes",
							"host": [
								"{{baseURL}}"
							],
							"path": [
								"api",
								"v1",
								"comments",
								"{{commentID}}",
								"likes"
							]
						}
					},
					"response": []
				},
				{
					"name": "DeleteComment",
					"event": [
						{
							"listen": "test",
							"script": {
								"id": "2eb33e99-a9ca-44a2-bd17-52a25d9af247",
								"exec": [
									"pm.test(\"Deleted Comment ID not found\", function () {\r",
									"\r",
									"    var jsonData = pm.response.json();\r",
									"    var commentid = pm.collectionVariables.get(\"commentID\");\r",
									"\r",
									"    pm.expect(jsonData.id).to.not.eql(commentid);\r",
									"});"
								],
								"type": "text/javascript"
							}
						},
						{
							"listen": "prerequest",
							"script": {
								"id": "d2ecd6d6-a72f-4242-85a1-0472fa6ed927",
								"exec": [
									""
								],
								"type": "text/javascript"
							}
						}
					],
					"request": {
						"method": "DELETE",
						"header": [
							{
								"key": "Cookie",
								"value": "{{cookie}}",
								"type": "text"
							}
						],
						"url": {
							"raw": "{{baseURL}}/api/v1/comments/{{commentID}}",
							"host": [
								"{{baseURL}}"
							],
							"path": [
								"api",
								"v1",
								"comments",
								"{{commentID}}"
							]
						}
					},
					"response": []
				},
				{
					"name": "DeletePost",
					"event": [
						{
							"listen": "test",
							"script": {
								"id": "c10ba5d7-d31e-4bc0-8f25-65022db0a940",
								"exec": [
									"pm.test(\"Deleted Post ID not found\", function () {\r",
									"\r",
									"    var jsonData = pm.response.json();\r",
									"    var postid = pm.collectionVariables.get(\"userID\");\r",
									"\r",
									"    pm.expect(jsonData.id).to.not.eql(postid);\r",
									"});"
								],
								"type": "text/javascript"
							}
						}
					],
					"request": {
						"method": "DELETE",
						"header": [
							{
								"key": "Cookie",
								"value": "{{cookie}}",
								"type": "text"
							}
						],
						"url": {
							"raw": "{{baseURL}}/api/v1/posts/{{postID}}",
							"host": [
								"{{baseURL}}"
							],
							"path": [
								"api",
								"v1",
								"posts",
								"{{postID}}"
							]
						}
					},
					"response": []
				},
				{
					"name": "Logout",
					"request": {
						"method": "GET",
						"header": [],
						"url": {
							"raw": "{{baseURL}}/logout",
							"host": [
								"{{baseURL}}"
							],
							"path": [
								"logout"
							]
						}
					},
					"response": []
				}
			],
			"event": [
				{
					"listen": "prerequest",
					"script": {
						"id": "b2ecc894-900b-484b-b3fd-1cb1f4788df5",
						"type": "text/javascript",
						"exec": [
							""
						]
					}
				},
				{
					"listen": "test",
					"script": {
						"id": "de03e11f-1e63-42e0-9474-83677d24233c",
						"type": "text/javascript",
						"exec": [
							"pm.test(\"Status code is 200\", function () {",
							"    pm.response.to.have.status(200);",
							"});"
						]
					}
				}
			],
			"protocolProfileBehavior": {}
		},
		{
			"name": "Connections",
			"item": [
				{
					"name": "Login",
					"event": [
						{
							"listen": "test",
							"script": {
								"id": "c06aea07-b88f-4703-a6c9-b8bb8c083787",
								"exec": [
									"pm.collectionVariables.set(\"SesionCookie\", pm.cookies.get('JSESSIONID'));\r",
									"\r",
									"console.log(pm.cookies.get('JSESSIONID'));"
								],
								"type": "text/javascript"
							}
						}
					],
					"request": {
						"method": "POST",
						"header": [],
						"body": {
							"mode": "formdata",
							"formdata": [
								{
									"key": "username",
									"value": "{{userUsername2}}",
									"type": "text"
								},
								{
									"key": "password",
									"value": "{{userPassword2}}",
									"type": "text"
								}
							]
						},
						"url": {
							"raw": "{{baseURL}}/authenticate",
							"host": [
								"{{baseURL}}"
							],
							"path": [
								"authenticate"
							]
						}
					},
					"response": []
				},
				{
					"name": "MyConnections",
					"event": [
						{
							"listen": "test",
							"script": {
								"id": "7a5b01cd-2d95-4a3a-94e8-3a725611dc40",
								"exec": [
									"let objects =pm.response.json();\r",
									"\r",
									"let count = 0;\r",
									"while (objects[count]!=null) {\r",
									"    count++;}\r",
									"\r",
									"pm.collectionVariables.set(\"connectionNumber\", count);\r",
									"\r",
									"console.log(pm.collectionVariables.get(\"connectionNumber\"))\r",
									"\r",
									"pm.test(\"User with id 1 is connected\", function () {\r",
									"\r",
									"    var jsonData = pm.response.json();\r",
									"\r",
									"    pm.expect(Array.isArray(jsonData));\r",
									"\r",
									"    jsonData.forEach((obj) => {\r",
									"        pm.expect(typeof obj.id).to.not.eql(\"undefined\");\r",
									"        pm.expect(obj.id).to.eql(1);\r",
									"    })\r",
									"});"
								],
								"type": "text/javascript"
							}
						}
					],
					"request": {
						"method": "GET",
						"header": [
							{
								"key": "Cookie",
								"value": "{{cookie}}",
								"type": "text"
							}
						],
						"url": {
							"raw": "{{baseURL}}/api/v1/connections/my",
							"host": [
								"{{baseURL}}"
							],
							"path": [
								"api",
								"v1",
								"connections",
								"my"
							]
						}
					},
					"response": []
				},
				{
					"name": "SendConnectionRequest",
					"event": [
						{
							"listen": "prerequest",
							"script": {
								"id": "b9358445-280c-4a0f-af19-0811c662072f",
								"exec": [
									"pm.collectionVariables.set(\"connectionID\", 5);"
								],
								"type": "text/javascript"
							}
						},
						{
							"listen": "test",
							"script": {
								"id": "93e3a9c1-4b70-43e3-8771-f381fc775ca1",
								"exec": [
									""
								],
								"type": "text/javascript"
							}
						}
					],
					"request": {
						"method": "POST",
						"header": [
							{
								"key": "Cookie",
								"value": "{{cookie}}",
								"type": "text"
							}
						],
						"url": {
							"raw": "{{baseURL}}/api/v1/connections/users/{{connectionID}}",
							"host": [
								"{{baseURL}}"
							],
							"path": [
								"api",
								"v1",
								"connections",
								"users",
								"{{connectionID}}"
							]
						}
					},
					"response": []
				},
				{
					"name": "ConnectionRequestsToMe",
					"event": [
						{
							"listen": "test",
							"script": {
								"id": "d8e87b2d-2b73-4603-ad7d-7461ea8e1d96",
								"exec": [
									"pm.test(\"User with id 5 sent connection request\", function () {\r",
									"\r",
									"    var jsonData = pm.response.json();\r",
									"\r",
									"    pm.expect(Array.isArray(jsonData));\r",
									"\r",
									"    jsonData.forEach((obj) => {\r",
									"        pm.expect(typeof obj.id).to.not.eql(\"undefined\");\r",
									"        pm.expect(obj.id).to.eql(5);\r",
									"    })\r",
									"});"
								],
								"type": "text/javascript"
							}
						}
					],
					"request": {
						"method": "GET",
						"header": [
							{
								"key": "Cookie",
								"value": "{{cookie}}",
								"type": "text"
							}
						],
						"url": {
							"raw": "{{baseURL}}/api/v1/connections/requests",
							"host": [
								"{{baseURL}}"
							],
							"path": [
								"api",
								"v1",
								"connections",
								"requests"
							]
						}
					},
					"response": []
				},
				{
					"name": "Logout",
					"request": {
						"method": "GET",
						"header": [],
						"url": {
							"raw": "{{baseURL}}/logout",
							"host": [
								"{{baseURL}}"
							],
							"path": [
								"logout"
							]
						}
					},
					"response": []
				}
			],
			"event": [
				{
					"listen": "prerequest",
					"script": {
						"id": "aa6b8900-ece2-4b2b-b20f-9838ea628010",
						"type": "text/javascript",
						"exec": [
							""
						]
					}
				},
				{
					"listen": "test",
					"script": {
						"id": "a7028478-7bf4-4345-bd7f-f851bf8d083d",
						"type": "text/javascript",
						"exec": [
							"pm.test(\"Status code is 200\", function () {",
							"    pm.response.to.have.status(200);",
							"});"
						]
					}
				}
			],
			"protocolProfileBehavior": {}
		},
		{
			"name": "NegativeTests",
			"item": [
				{
					"name": "Nationality",
					"item": [
						{
							"name": "Login",
							"event": [
								{
									"listen": "test",
									"script": {
										"id": "5099f0d7-edc3-4fdb-ad98-0ea338107603",
										"exec": [
											"pm.collectionVariables.set(\"SesionCookie\", pm.cookies.get('JSESSIONID'));\r",
											"\r",
											"console.log(pm.cookies.get('JSESSIONID'));\r",
											"\r",
											"pm.test(\"Status code is 200\", function () {\r",
											"    pm.response.to.have.status(200);\r",
											"});"
										],
										"type": "text/javascript"
									}
								}
							],
							"request": {
								"method": "POST",
								"header": [],
								"body": {
									"mode": "formdata",
									"formdata": [
										{
											"key": "username",
											"value": "{{userUsername2}}",
											"type": "text"
										},
										{
											"key": "password",
											"value": "{{userPassword2}}",
											"type": "text"
										}
									]
								},
								"url": {
									"raw": "{{baseURL}}/authenticate",
									"host": [
										"{{baseURL}}"
									],
									"path": [
										"authenticate"
									]
								}
							},
							"response": []
						},
						{
							"name": "AllNationalities",
							"event": [
								{
									"listen": "test",
									"script": {
										"id": "be4751a3-fe4d-4e81-8ea8-9a2c4bee8df7",
										"exec": [
											"pm.test(\"Status code is 403 - for regular User\", function () {\r",
											"    pm.response.to.have.status(403);\r",
											"});"
										],
										"type": "text/javascript"
									}
								}
							],
							"request": {
								"method": "GET",
								"header": [
									{
										"key": "Cookie",
										"value": "{{cookie}}",
										"type": "text"
									}
								],
								"url": {
									"raw": "{{baseURL}}/api/v1/admin/nationalities",
									"host": [
										"{{baseURL}}"
									],
									"path": [
										"api",
										"v1",
										"admin",
										"nationalities"
									]
								}
							},
							"response": []
						},
						{
							"name": "CreateNationality",
							"event": [
								{
									"listen": "prerequest",
									"script": {
										"id": "7c774337-a61d-49af-ada2-674a66e90840",
										"exec": [
											"pm.collectionVariables.set(\"nationality\", \"Lolo\")"
										],
										"type": "text/javascript"
									}
								},
								{
									"listen": "test",
									"script": {
										"id": "406fbd7b-aa2e-4b85-be6f-6548f23a5936",
										"exec": [
											"pm.collectionVariables.set(\"nationalityID\", pm.response.json().id);\r",
											"\r",
											"pm.test(\"Status code is 405 - for regular User\", function () {\r",
											"    pm.response.to.have.status(405);\r",
											"});"
										],
										"type": "text/javascript"
									}
								}
							],
							"request": {
								"method": "POST",
								"header": [
									{
										"key": "Cookie",
										"value": "{{cookie}}",
										"type": "text"
									}
								],
								"body": {
									"mode": "raw",
									"raw": "{\r\n   \"nationality\": \"{{nationality}}\"\r\n}",
									"options": {
										"raw": {
											"language": "json"
										}
									}
								},
								"url": {
									"raw": "{{baseURL}}/api/v1/admin/nationalities",
									"host": [
										"{{baseURL}}"
									],
									"path": [
										"api",
										"v1",
										"admin",
										"nationalities"
									]
								}
							},
							"response": []
						},
						{
							"name": "EditNationality",
							"event": [
								{
									"listen": "prerequest",
									"script": {
										"id": "afca1fc6-f4a7-44c4-a9d9-8a7d6c858783",
										"exec": [
											"pm.collectionVariables.set(\"nationalityupdate\", \"updateLolo\")"
										],
										"type": "text/javascript"
									}
								},
								{
									"listen": "test",
									"script": {
										"id": "449e7aca-2776-4313-916d-d76ab8dbb928",
										"exec": [
											"pm.test(\"Status code is 405 - for regular User\", function () {\r",
											"    pm.response.to.have.status(405);\r",
											"});"
										],
										"type": "text/javascript"
									}
								}
							],
							"request": {
								"method": "PUT",
								"header": [
									{
										"key": "Cookie",
										"type": "text",
										"value": "{{cookie}}"
									}
								],
								"body": {
									"mode": "raw",
									"raw": "{\r\n    \"id\": {{nationalityID}},\r\n    \"nationality\":\"{{nationalityupdate}}\"\r\n}",
									"options": {
										"raw": {
											"language": "json"
										}
									}
								},
								"url": {
									"raw": "{{baseURL}}/api/v1/admin/nationalities",
									"host": [
										"{{baseURL}}"
									],
									"path": [
										"api",
										"v1",
										"admin",
										"nationalities"
									]
								}
							},
							"response": []
						},
						{
							"name": "DeleteNationality",
							"event": [
								{
									"listen": "prerequest",
									"script": {
										"id": "19c10530-111f-42ed-88cd-0b89b731562d",
										"exec": [
											""
										],
										"type": "text/javascript"
									}
								},
								{
									"listen": "test",
									"script": {
										"id": "0a5fcedd-c217-4924-ab38-e953ff633059",
										"exec": [
											"pm.test(\"Status code is 405 - for regular User\", function () {\r",
											"    pm.response.to.have.status(405);\r",
											"});"
										],
										"type": "text/javascript"
									}
								}
							],
							"request": {
								"method": "DELETE",
								"header": [],
								"url": {
									"raw": "{{baseURL}}/api/v1/admin/nationalities/{{nationalityID}}",
									"host": [
										"{{baseURL}}"
									],
									"path": [
										"api",
										"v1",
										"admin",
										"nationalities",
										"{{nationalityID}}"
									],
									"query": [
										{
											"key": "Cookie",
											"value": "{{cookie}}",
											"disabled": true
										}
									]
								}
							},
							"response": []
						},
						{
							"name": "Logout",
							"event": [
								{
									"listen": "test",
									"script": {
										"id": "de9c3f51-4fda-4666-9344-206740242dc3",
										"exec": [
											"pm.test(\"Status code is 200\", function () {\r",
											"    pm.response.to.have.status(200);\r",
											"});"
										],
										"type": "text/javascript"
									}
								}
							],
							"request": {
								"method": "GET",
								"header": [],
								"url": {
									"raw": "{{baseURL}}/logout",
									"host": [
										"{{baseURL}}"
									],
									"path": [
										"logout"
									]
								}
							},
							"response": []
						}
					],
					"event": [
						{
							"listen": "prerequest",
							"script": {
								"id": "43279667-fb3d-40b3-aba8-b0fe23c208c3",
								"type": "text/javascript",
								"exec": [
									""
								]
							}
						},
						{
							"listen": "test",
							"script": {
								"id": "261c901b-e751-4325-b5d5-472fbe5048ca",
								"type": "text/javascript",
								"exec": [
									""
								]
							}
						}
					],
					"protocolProfileBehavior": {},
					"_postman_isSubFolder": true
				},
				{
					"name": "Category",
					"item": [
						{
							"name": "Login",
							"event": [
								{
									"listen": "test",
									"script": {
										"id": "5c6b836b-82ac-4547-ac73-5995d37c1b7a",
										"exec": [
											"pm.collectionVariables.set(\"SesionCookie\", pm.cookies.get('JSESSIONID'));\r",
											"\r",
											"console.log(pm.cookies.get('JSESSIONID'));"
										],
										"type": "text/javascript"
									}
								}
							],
							"request": {
								"method": "POST",
								"header": [],
								"body": {
									"mode": "formdata",
									"formdata": [
										{
											"key": "username",
											"value": "{{userUsername2}}",
											"type": "text"
										},
										{
											"key": "password",
											"value": "{{userPassword2}}",
											"type": "text"
										}
									]
								},
								"url": {
									"raw": "{{baseURL}}/authenticate",
									"host": [
										"{{baseURL}}"
									],
									"path": [
										"authenticate"
									]
								}
							},
							"response": []
						},
						{
							"name": "AllCategories",
							"event": [
								{
									"listen": "test",
									"script": {
										"id": "4fa1075a-b13d-499f-8470-6a4a4a9d8f5c",
										"exec": [
											"pm.test(\"Status code is 403 - for regular User\", function () {\r",
											"    pm.response.to.have.status(403);\r",
											"});"
										],
										"type": "text/javascript"
									}
								}
							],
							"request": {
								"method": "GET",
								"header": [
									{
										"key": "Cookie",
										"value": "{{cookie}}",
										"type": "text"
									}
								],
								"url": {
									"raw": "{{baseURL}}/api/v1/admin/categories",
									"host": [
										"{{baseURL}}"
									],
									"path": [
										"api",
										"v1",
										"admin",
										"categories"
									]
								}
							},
							"response": []
						},
						{
							"name": "CreateCategory",
							"event": [
								{
									"listen": "test",
									"script": {
										"id": "38f1d501-cea5-462e-a8cc-d2cfd054b581",
										"exec": [
											"pm.collectionVariables.set(\"categoryID\", pm.response.json().id);\r",
											"\r",
											"pm.test(\"Status code is 405 - for regular User\", function () {\r",
											"    pm.response.to.have.status(405);\r",
											"});"
										],
										"type": "text/javascript"
									}
								}
							],
							"request": {
								"method": "POST",
								"header": [
									{
										"key": "Cookie",
										"value": "{{cookie}}",
										"type": "text"
									}
								],
								"body": {
									"mode": "formdata",
									"formdata": [
										{
											"key": "category",
											"type": "file",
											"src": "DataFormFiles/category.json"
										},
										{
											"key": "file",
											"type": "file",
											"src": "DataFormFiles/smoothies.png"
										}
									],
									"options": {
										"formdata": {}
									}
								},
								"url": {
									"raw": "{{baseURL}}/api/v1/admin/categories",
									"host": [
										"{{baseURL}}"
									],
									"path": [
										"api",
										"v1",
										"admin",
										"categories"
									]
								}
							},
							"response": []
						},
						{
							"name": "UpdateCategory",
							"event": [
								{
									"listen": "test",
									"script": {
										"id": "132c3f02-a065-4ab2-9634-b90b19a74d23",
										"exec": [
											"pm.test(\"Status code is 405 - for regular User\", function () {\r",
											"    pm.response.to.have.status(405);\r",
											"});"
										],
										"type": "text/javascript"
									}
								}
							],
							"request": {
								"method": "PUT",
								"header": [
									{
										"key": "Cookie",
										"value": "{{cookie}}",
										"type": "text"
									}
								],
								"body": {
									"mode": "formdata",
									"formdata": [
										{
											"key": "category",
											"type": "file",
											"src": "DataFormFiles/updateCategory.json"
										},
										{
											"key": "file",
											"type": "file",
											"src": "DataFormFiles/smoothies.png"
										}
									],
									"options": {
										"formdata": {}
									}
								},
								"url": {
									"raw": "{{baseURL}}/api/v1/admin/categories/{{categoryID}}",
									"host": [
										"{{baseURL}}"
									],
									"path": [
										"api",
										"v1",
										"admin",
										"categories",
										"{{categoryID}}"
									]
								}
							},
							"response": []
						},
						{
							"name": "DeleteCategory",
							"event": [
								{
									"listen": "test",
									"script": {
										"id": "151819b2-e8d2-4dbd-b15a-2fdc5ece4cbd",
										"exec": [
											"pm.test(\"Status code is 405 - for regular User\", function () {\r",
											"    pm.response.to.have.status(405);\r",
											"});"
										],
										"type": "text/javascript"
									}
								}
							],
							"request": {
								"method": "DELETE",
								"header": [
									{
										"key": "Cookie",
										"value": "{{cookie}}",
										"type": "text"
									}
								],
								"url": {
									"raw": "{{baseURL}}/api/v1/admin/categories/{{categoryID}}",
									"host": [
										"{{baseURL}}"
									],
									"path": [
										"api",
										"v1",
										"admin",
										"categories",
										"{{categoryID}}"
									]
								}
							},
							"response": []
						},
						{
							"name": "Logout",
							"request": {
								"method": "GET",
								"header": [],
								"url": {
									"raw": "{{baseURL}}/logout",
									"host": [
										"{{baseURL}}"
									],
									"path": [
										"logout"
									]
								}
							},
							"response": []
						}
					],
					"protocolProfileBehavior": {},
					"_postman_isSubFolder": true
				}
			],
			"protocolProfileBehavior": {}
		}
	],
	"event": [
		{
			"listen": "prerequest",
			"script": {
				"id": "92795588-7ae5-4f1f-ba83-1e9ae1c1a6aa",
				"type": "text/javascript",
				"exec": [
					""
				]
			}
		},
		{
			"listen": "test",
			"script": {
				"id": "d1740793-f33f-4222-927a-06d696e85620",
				"type": "text/javascript",
				"exec": [
					""
				]
			}
		}
	],
	"variable": [
		{
			"id": "113ff6b2-c529-4c3a-8d0f-82a03b3aee57",
			"key": "categoryID",
			"value": ""
		},
		{
			"id": "c9aad315-e6ef-4576-b19e-897c8550f708",
			"key": "postID",
			"value": "1"
		},
		{
			"id": "7bb17ab8-fc95-4a4d-9218-7d9df9ab0bef",
			"key": "userID",
			"value": ""
		},
		{
			"id": "de01360d-4c4d-4283-8847-6594504c32ef",
			"key": "commentID",
			"value": ""
		},
		{
			"id": "f752a1d6-c868-4062-9888-49e36aab41c8",
			"key": "comment",
			"value": ""
		},
		{
			"id": "868ff700-118d-4ab5-8f7e-30c3646bf605",
			"key": "nationsNumber",
			"value": ""
		},
		{
			"id": "3f1acb9d-1f9a-41e2-96f4-d2dbf99ad1d0",
			"key": "postLikes",
			"value": ""
		},
		{
			"id": "b3188cb5-c2b6-41fd-a40d-88ce2dc3d626",
			"key": "nations",
			"value": ""
		},
		{
			"id": "a3cee608-abaa-4878-b402-5520fbd0988e",
			"key": "nationalityID",
			"value": ""
		},
		{
			"id": "fa7cb313-b59e-49f5-a4ea-498cff56a7cd",
			"key": "nationality",
			"value": ""
		},
		{
			"id": "ef2d46d2-7a36-4e08-9de4-9db62233e844",
			"key": "connectionNumber",
			"value": ""
		},
		{
			"id": "c68378eb-bd25-46cb-81fa-780aa8474c0b",
			"key": "requestsNumber",
			"value": ""
		},
		{
			"id": "a53570a2-aa76-4870-bc29-70b0bb32b944",
			"key": "connectionID",
			"value": ""
		},
		{
			"id": "95053a7c-92da-4775-b53e-4b666f11cd1a",
			"key": "commentLikes",
			"value": ""
		},
		{
			"id": "ef7ca31e-4a19-4b76-9898-bbb97fbd0d6a",
			"key": "nationalityupdate",
			"value": ""
		},
		{
			"id": "3bc68531-87b7-40d3-95bd-936fdcc0fe08",
			"key": "requestIdForDeletion",
			"value": ""
		},
		{
			"id": "cf7d35e3-2d54-4114-a8ff-332f24cd639b",
			"key": "top3PostCount",
			"value": ""
		},
		{
			"id": "a8bb7409-ba80-4d43-87a1-a7d9d8fe67c9",
			"key": "userUsername2",
			"value": "qaolympus2@abv.bg"
		},
		{
			"id": "7cad6d02-67ea-481b-9ef5-828fc007391e",
			"key": "userPassword2",
			"value": "Ol!mpus2"
		},
		{
			"id": "bd19fb82-580d-4680-9cdb-df5a98116101",
			"key": "SesionCookie",
			"value": ""
		}
	],
	"protocolProfileBehavior": {}
}