{
	"id": "28cd8daa-2c61-4bae-b749-1dfce6ee1a8b",
	"name": "HealtyFood",
	"values": [
		{
			"key": "baseURL",
			"value": "https://infinite-basin-89429.herokuapp.com",
			"enabled": true
		}
	],
	"_postman_variable_scope": "environment",
	"_postman_exported_at": "2020-11-09T20:04:35.256Z",
	"_postman_exported_using": "Postman/7.35.0"
}