[{
        "id": {
            "@type": "g:Int64",
            "@value": 0
        },
        "label": "Университет",
        "outE": {
            "входит в состав": [{
                    "id": {
                        "@type": "g:Int64",
                        "@value": 7
                    },
                    "inV": {
                        "@type": "g:Int64",
                        "@value": 3
                    }
                }, {
                    "id": {
                        "@type": "g:Int64",
                        "@value": 8
                    },
                    "inV": {
                        "@type": "g:Int64",
                        "@value": 5
                    }
                }]
        },
        "properties": {
            "address": [{
                    "id": {
                        "@type": "g:Int64",
                        "@value": 2
                    },
                    "value": "г. Хабаровск, ул. Тихоокенская, 136"
                }],
            "name": [{
                    "id": {
                        "@type": "g:Int64",
                        "@value": 1
                    },
                    "value": "Тихоокеанский государсвенный университет"
                }]
        }
    },
    
    
    
    {
        "id": {
            "@type": "g:Int64",
            "@value": 3
        },
        "label": "Факультет",
        "inE": {
            "входит в состав": [{
                    "id": {
                        "@type": "g:Int64",
                        "@value": 7
                    },
                    "outV": {
                        "@type": "g:Int64",
                        "@value": 0
                    }
                }]
        },
        "properties": {
            "name": [{
                    "id": {
                        "@type": "g:Int64",
                        "@value": 4
                    },
                    "value": "Физический факультет"
                }]
        }
    },
    
    
    
    {
        "id": {
            "@type": "g:Int64",
            "@value": 5
        },
        "label": "Факультет",
        "inE": {
            "входит в состав": [{
                    "id": {
                        "@type": "g:Int64",
                        "@value": 8
                    },
                    "outV": {
                        "@type": "g:Int64",
                        "@value": 0
                    }
                }]
        },
        "properties": {
            "name": [{
                    "id": {
                        "@type": "g:Int64",
                        "@value": 6
                    },
                    "value": "Химический факультет"
                }]
        }
    }
]
