[

    {
        "id": {
            "@type": "g:Int64",
            "@value": 0
        },
        "label": "Университет",
        "inE": {
            "явялется подразделением": [{
                    "id": {
                        "@type": "g:Int64",
                        "@value": 11
                    },
                    "outV": {
                        "@type": "g:Int64",
                        "@value": 5
                    }
                }, {
                    "id": {
                        "@type": "g:Int64",
                        "@value": 12
                    },
                    "outV": {
                        "@type": "g:Int64",
                        "@value": 8
                    }
                }]
        },
        "properties": {
            "год основания": [{
                    "id": {
                        "@type": "g:Int64",
                        "@value": 4
                    },
                    "value": {
                        "@type": "g:Int32",
                        "@value": 1958
                    }
                }],
            "address": [{
                    "id": {
                        "@type": "g:Int64",
                        "@value": 3
                    },
                    "value": "г. Хабаровск, ул. Тихоокенская, 136"
                }],
            "name": [{
                    "id": {
                        "@type": "g:Int64",
                        "@value": 2
                    },
                    "value": "Тихоокеанский государсвенный университет"
                }],
            "type": [{
                    "id": {
                        "@type": "g:Int64",
                        "@value": 1
                    },
                    "value": "Учебное заведение"
                }]
        }
    },
    
    
    
    {
        "id": {
            "@type": "g:Int64",
            "@value": 19
        },
        "label": "Студенческая группа",
        "outE": {
            "группа факультета": [{
                    "id": {
                        "@type": "g:Int64",
                        "@value": 28
                    },
                    "inV": {
                        "@type": "g:Int64",
                        "@value": 5
                    }
                }]
        },
        "properties": {
            "name": [{
                    "id": {
                        "@type": "g:Int64",
                        "@value": 21
                    },
                    "value": "F2"
                }],
            "studenCount": [{
                    "id": {
                        "@type": "g:Int64",
                        "@value": 22
                    },
                    "value": {
                        "@type": "g:Int32",
                        "@value": 22
                    }
                }],
            "type": [{
                    "id": {
                        "@type": "g:Int64",
                        "@value": 20
                    },
                    "value": "Студенческая группа"
                }]
        }
    },
    
    
    
    {
        "id": {
            "@type": "g:Int64",
            "@value": 5
        },
        "label": "Подразделение",
        "inE": {
            "группа факультета": [{
                    "id": {
                        "@type": "g:Int64",
                        "@value": 27
                    },
                    "outV": {
                        "@type": "g:Int64",
                        "@value": 15
                    }
                }, {
                    "id": {
                        "@type": "g:Int64",
                        "@value": 28
                    },
                    "outV": {
                        "@type": "g:Int64",
                        "@value": 19
                    }
                }, {
                    "id": {
                        "@type": "g:Int64",
                        "@value": 29
                    },
                    "outV": {
                        "@type": "g:Int64",
                        "@value": 23
                    }
                }]
        },
        "outE": {
            "явялется подразделением": [{
                    "id": {
                        "@type": "g:Int64",
                        "@value": 11
                    },
                    "inV": {
                        "@type": "g:Int64",
                        "@value": 0
                    }
                }]
        },
        "properties": {
            "год основания": [{
                    "id": {
                        "@type": "g:Int64",
                        "@value": 13
                    },
                    "value": {
                        "@type": "g:Int32",
                        "@value": 1975
                    }
                }],
            "name": [{
                    "id": {
                        "@type": "g:Int64",
                        "@value": 6
                    },
                    "value": "Физический факультет"
                }],
            "type": [{
                    "id": {
                        "@type": "g:Int64",
                        "@value": 7
                    },
                    "value": "Факультет"
                }]
        }
    },
    
    
    
    
    {
        "id": {
            "@type": "g:Int64",
            "@value": 23
        },
        "label": "Студенческая группа",
        "outE": {
            "группа факультета": [{
                    "id": {
                        "@type": "g:Int64",
                        "@value": 29
                    },
                    "inV": {
                        "@type": "g:Int64",
                        "@value": 5
                    }
                }]
        },
        "properties": {
            "name": [{
                    "id": {
                        "@type": "g:Int64",
                        "@value": 25
                    },
                    "value": "F3"
                }],
            "studenCount": [{
                    "id": {
                        "@type": "g:Int64",
                        "@value": 26
                    },
                    "value": {
                        "@type": "g:Int32",
                        "@value": 20
                    }
                }],
            "type": [{
                    "id": {
                        "@type": "g:Int64",
                        "@value": 24
                    },
                    "value": "Студенческая группа"
                }]
        }
    },
    {
        "id": {
            "@type": "g:Int64",
            "@value": 8
        },
        "label": "Подразделение",
        "outE": {
            "явялется подразделением": [{
                    "id": {
                        "@type": "g:Int64",
                        "@value": 12
                    },
                    "inV": {
                        "@type": "g:Int64",
                        "@value": 0
                    }
                }]
        },
        "properties": {
            "год основания": [{
                    "id": {
                        "@type": "g:Int64",
                        "@value": 14
                    },
                    "value": {
                        "@type": "g:Int32",
                        "@value": 1968
                    }
                }],
            "name": [{
                    "id": {
                        "@type": "g:Int64",
                        "@value": 9
                    },
                    "value": "Химический факультет"
                }],
            "type": [{
                    "id": {
                        "@type": "g:Int64",
                        "@value": 10
                    },
                    "value": "Факультет"
                }]
        }
    },
    {
        "id": {
            "@type": "g:Int64",
            "@value": 15
        },
        "label": "Студенческая группа",
        "outE": {
            "группа факультета": [{
                    "id": {
                        "@type": "g:Int64",
                        "@value": 27
                    },
                    "inV": {
                        "@type": "g:Int64",
                        "@value": 5
                    }
                }]
        },
        "properties": {
            "name": [{
                    "id": {
                        "@type": "g:Int64",
                        "@value": 17
                    },
                    "value": "F1"
                }],
            "studenCount": [{
                    "id": {
                        "@type": "g:Int64",
                        "@value": 18
                    },
                    "value": {
                        "@type": "g:Int32",
                        "@value": 15
                    }
                }],
            "type": [{
                    "id": {
                        "@type": "g:Int64",
                        "@value": 16
                    },
                    "value": "Студенческая группа"
                }]
        }
    }


]