1.018750000000000044e+00
1.199500000000000011e-01
3.393250000000000099e+00
4.730475177474047221e-02
3.691517324134171302e-02
9.877488989599451930e-02
5.726594654299793641e-02
3.813899149558250962e-02
2.329254377519247160e-02
1.378604773372004745e-02
8.078878074935340325e-03
4.633350164717618506e-03
2.531857206592807302e-03
1.312908956336034019e-03
2.444183064057163859e-02
1.654188356840236018e-02
6.160770413415821850e-02
2.996926910493166729e-02
1.753968287241292404e-02
9.850628265744636528e-03
4.796236115923827557e-03
2.292019199388309423e-03
1.132800373275982169e-03
5.237037042788345075e-04
2.763589596765959888e-04
1.355392111842870090e-02
7.042923076074097087e-03
4.102749525552633336e-02
1.897812962205324555e-02
8.223429702124336951e-03
4.290639879083808957e-03
2.323481155198081020e-03
8.888999514315498252e-04
3.137376116810357599e-04
1.706701575582010957e-04
1.023760915767183192e-04
9.249075328515427366e-03
4.165764036760710547e-03
2.621065312279665174e-02
1.376324178680951929e-02
5.759922978369013194e-03
1.240667127859757272e-03
7.902362939420420809e-04
5.913795381565045521e-04
1.706260175389434988e-04
1.884572567181597933e-05
9.453168725252527333e-07
8.430813991583741007e-03
3.253382857737141271e-03
1.605944710962366878e-02
7.683464271228993350e-03
5.422832229183914728e-03
1.538428204318900878e-03
-2.230727199988871386e-04
-3.369997936913501544e-05
1.869826806070783523e-04
7.367507861202318362e-05
-1.367969752753603517e-05
6.158500484728237495e-03
2.146837931142575335e-03
1.216817379681691541e-02
2.435426974051274184e-03
2.479939554649704218e-03
2.028691099521929761e-03
6.202311667208270903e-04
-1.621566944456393638e-04
-1.669733450621045429e-04
1.125784985297388335e-06
4.277778152791990849e-05
1.254508973036301024e-02
1.143022736312225215e-02
3.931785400938824643e-02
2.783636203494558106e-02
2.098137336096837779e-02
1.596289244125052506e-02
1.112899603149673788e-02
7.161003109101574983e-03
4.737091690034543091e-03
3.194576720734412009e-03
2.056711844462140101e-03
6.823739342115135373e-03
5.824307514544627314e-03
2.405845066639016733e-02
1.669410445803145432e-02
1.069431008151246892e-02
6.512462845845123222e-03
4.727163960078812829e-03
2.837045861963281845e-03
1.405580923540186407e-03
7.580342407869470082e-04
4.489392945276867233e-04
4.418914180999993120e-03
4.098261560928803150e-03
1.532667592747606264e-02
1.022072931722162008e-02
7.100656048710805683e-03
2.894545349721409488e-03
1.413151511185521507e-03
1.301977326158874817e-03
7.430575264581756488e-04
2.231087083306046122e-04
9.856454302916238107e-05
3.751737358945060954e-03
2.806096161747542554e-03
1.019704293488141525e-02
5.732734730305455613e-03
4.976262395009463900e-03
2.557108244472663244e-03
3.888802584386175424e-04
1.312633532261590055e-05
3.408120647125646957e-04
2.846254203918752211e-04
3.691487081869626553e-05
2.537508963409931210e-03
1.032641686607041779e-03
7.614206390473540753e-03
2.767626299591531298e-03
2.497159206784596922e-03
2.212728464774331178e-03
9.524449832109955745e-04
-7.450367483727182607e-05
-2.413069827093000804e-04
3.304861309882030706e-06
1.285541023034331566e-04
3.869361680306188968e-03
4.841870645299559302e-03
1.612260883693086497e-02
1.400332114299002347e-02
1.266574411394080432e-02
9.361950962165504347e-03
7.519416586603831602e-03
6.117296255178358844e-03
4.237335458269078994e-03
2.835902289430782680e-03
2.058536084796459050e-03
2.533730406673526548e-03
3.367657401671784838e-03
1.051673347999696091e-02
8.022367115860457379e-03
7.452013748850584360e-03
4.992211007487328336e-03
2.874754170815342971e-03
2.260602916041978827e-03
1.856230101003996345e-03
1.063129192721282840e-03
5.032624997508806323e-04
2.053504596414310567e-03
2.181403336772338476e-03
7.142877289710481900e-03
4.683728877429753704e-03
4.410721507613680516e-03
3.247759277100013310e-03
1.442019751409471650e-03
5.050207602131775780e-04
5.191909241370656946e-04
5.693806178136549172e-04
2.969667115424744252e-04
1.287203483586240932e-03
6.631499749324734324e-04
5.228727038737990100e-03
2.784758865497808430e-03
2.388719614512651353e-03
2.172469162543381321e-03
1.298672462207120949e-03
2.857640657068755792e-04
-9.459773360669045290e-05
4.135038108230301788e-05
1.963220254462180172e-04
1.621536984853176686e-03
2.592267478854156509e-03
7.769651416566506798e-03
6.757469048643481059e-03
7.307368092569779816e-03
6.586872697439295245e-03
4.963342594467332926e-03
3.900576747579023642e-03
3.432172154642252389e-03
2.787600881807800277e-03
1.926059624412834953e-03
1.289502767823130260e-03
1.735496300847438758e-03
5.302041005248683825e-03
4.160258695266184047e-03
4.169091489337865136e-03
3.806950681982466944e-03
2.664945697724280856e-03
1.553595786602665445e-03
1.139713680826473854e-03
1.061671309356940164e-03
8.382293674357043809e-04
7.378581708916454344e-04
4.740559663312221539e-04
3.737116641123790738e-03
2.567391361386576077e-03
2.310212917427140189e-03
2.145590135240746290e-03
1.649299929125163430e-03
8.219033327830737971e-04
2.689431900151443016e-04
1.980383280998724562e-04
2.831734021483496219e-04
