1.178050000000000042e+00
1.442950000000000177e+00
3.840250000000000163e+00
6.119653571690809174e-02
4.905896901584196057e-02
1.517825016365583757e-01
8.817170772747230656e-02
6.010025152301039231e-02
3.917860485954447608e-02
2.280332364254575653e-02
1.298511542592946377e-02
7.766022538804162774e-03
4.587633230766789173e-03
2.642298715879955531e-03
3.079200370332524014e-02
1.979554892005219377e-02
8.890929717080767181e-02
4.991288590181008206e-02
2.554157253877767028e-02
1.421461126216905409e-02
9.175526413354380059e-03
4.395784806059998065e-03
1.809649122547782448e-03
9.283397136881829095e-04
5.246063298659718295e-04
2.005757539169571863e-02
1.293118184804781592e-02
5.102944200429960359e-02
3.109623990830321857e-02
1.799239082317594801e-02
4.560322854407206777e-03
1.860919807641829224e-03
2.135329271477492876e-03
1.028787938087128134e-03
1.580671686060509853e-04
2.854735990953820367e-05
1.705166703666096198e-02
8.069923439159833178e-03
3.041076950791778491e-02
1.347960804359646554e-02
1.322021501864430182e-02
6.514226846257466577e-03
3.682704191021190262e-04
-7.409605593432005890e-04
2.415787058478070391e-04
4.668955908277549875e-04
1.103688468977571615e-04
8.893319455924850181e-03
4.090267567621010819e-03
2.499237268459389427e-02
3.624675046631783016e-03
3.169434779274336519e-03
4.418243858176093206e-03
2.833533271540738304e-03
5.208887358562118517e-04
-4.480152221517518137e-04
-3.111662052250776904e-04
1.213856384888141006e-05
1.116746598217062316e-03
4.728531785081814889e-03
2.508016849268382420e-02
4.510942700628400338e-03
-5.808220625741494650e-04
-5.054371762841781924e-04
6.472678972939998254e-04
8.468413891198242312e-04
4.356459154273971553e-04
7.257134506789616611e-05
-6.143490583800823533e-05
1.471677859268588455e-02
1.636855832895567006e-02
5.217791802597258888e-02
4.244671107249501502e-02
3.335715226427998087e-02
2.200718067630155067e-02
1.720807875860010799e-02
1.267452993736495857e-02
7.639088980016731437e-03
4.680090126640109455e-03
3.198668245612224133e-03
9.235796157879448340e-03
1.100958503919897621e-02
3.089896898406218131e-02
2.214022943971455729e-02
1.930924964786397136e-02
1.047207269683131728e-02
4.726668246937112093e-03
4.005904101805457529e-03
3.374005738864593439e-03
1.614935540815432002e-03
5.779549537808691606e-04
7.249291924888569966e-03
5.820081405115642807e-03
1.983571617118559671e-02
1.109528680311981652e-02
1.095064866041905137e-02
7.867194565068147752e-03
2.691846646773693105e-03
5.392465863501827699e-05
3.708493846407058146e-04
9.628423530406157249e-04
5.848158978493184701e-04
3.418772915397908559e-03
1.206961447786727504e-03
1.472454604915097477e-02
5.390523530838313773e-03
4.293988633644862593e-03
4.673674227888954293e-03
3.395379323314631163e-03
9.347466372492888986e-04
-4.780591467483833812e-04
-4.411240638657360912e-04
7.809949996319970485e-05
4.529705323578070019e-04
1.113246680899766718e-03
1.259417784660058805e-02
3.638187807488913166e-03
9.007509088562841437e-04
8.110596330780290610e-04
1.574505720012756146e-03
1.513350679732872314e-03
6.948562306721598565e-04
-2.250546926592723228e-05
-2.652199788798574576e-04
5.249717545779078280e-03
8.390048668357597342e-03
2.180955100513979131e-02
1.797596502925343301e-02
1.891757435756020664e-02
1.576522323281740606e-02
1.057908800785530359e-02
7.775420600390720548e-03
6.897298510182816624e-03
5.416238065423417854e-03
3.338176027221723997e-03
3.825299410477822626e-03
4.278076718261944293e-03
1.387057779175122560e-02
9.796685693661285818e-03
9.638327747372105528e-03
8.631679418398234202e-03
5.517165482116254994e-03
2.432065134691899742e-03
1.459356317927835728e-03
1.658313331745286424e-03
1.500692753109888122e-03
1.650198431425813766e-03
5.571684754858691321e-04
9.743033218883387012e-03
5.655417119813158783e-03
4.735112280291040900e-03
4.493536986250672507e-03
3.705835644835125606e-03
1.831900973520790912e-03
2.297856676653198510e-04
-1.196887380747091754e-04
2.279888984953374438e-04
2.834084944525629536e-04
2.635885002759982376e-04
7.536138319084761603e-03
3.659220118924435324e-03
2.215216147386968835e-03
1.816755797326640451e-03
1.941399561334032978e-03
1.660753162902904112e-03
7.896519596821196261e-04
-5.102322313754306589e-05
-3.250050871569501779e-04
2.308602486166580828e-03
3.329059954087680052e-03
1.029601635157461129e-02
9.001238094260132633e-03
9.496746418620959432e-03
9.583703205088025395e-03
8.408823137601965578e-03
6.009635590386790821e-03
4.197536845842006654e-03
3.617555034698008085e-03
3.308693529305244303e-03
8.632683299848567570e-04
2.529308694450056890e-04
6.686890722817548025e-03
5.136774835878477746e-03
4.758506195310658292e-03
4.555533723957074475e-03
4.159290855772370885e-03
3.057898001255730629e-03
1.606609236316497782e-03
7.580471507748682593e-04
7.000458579810137603e-04
2.296463176832189677e-04
1.003340327808413741e-04
5.019027717602505753e-03
3.441645267359035205e-03
2.811838638105399347e-03
2.294439458000540819e-03
2.137782402418211998e-03
1.804730334039127571e-03
1.128815383973655415e-03
3.740816148834563920e-04
-2.571437521607381946e-05
