7.745499999999999607e-01
8.073499999999999011e-01
2.347750000000000004e+00
2.437405133146334016e-02
1.049081665193465213e-02
8.785094542706853304e-02
4.984861477144382491e-02
3.256836627515651700e-02
1.966070430245119710e-02
1.152664600979233685e-02
6.691671387485844356e-03
3.912318778135639823e-03
2.230875995330053839e-03
1.183022691865998023e-03
1.460524110379634449e-02
6.080544816390509241e-03
5.946469544099409338e-02
2.897689477859316867e-02
1.659030566917050684e-02
8.632510927853427260e-03
4.376053574034732482e-03
2.155695756368532917e-03
1.014822094307173258e-03
4.674137877885859035e-04
2.377461305977612534e-04
8.930280119227484298e-03
3.576623498848350777e-03
4.243383442316029514e-02
1.807000969380625002e-02
9.333247315518565512e-03
4.236647971897725996e-03
1.853694246417464256e-03
8.000942620552136840e-04
3.488357511543011707e-04
1.547185462173967575e-04
6.440369738525527016e-05
5.579356145575684045e-03
1.901015879448171662e-03
3.165652107730831943e-02
1.182512993216611012e-02
5.618753075122161732e-03
2.344468466248853921e-03
8.948931589115437669e-04
3.488814268991990921e-04
1.284763855721105159e-04
4.464587504596418581e-05
1.830421956708350173e-05
3.653014384865585149e-03
7.611061011100244333e-04
2.431390684217326834e-02
8.338024265039749999e-03
3.349387594092718273e-03
1.409643816965601209e-03
4.992689630965530066e-04
1.437373235850714808e-04
5.891923226997743113e-05
2.539198828295027250e-05
5.288569198626714526e-06
2.617773273168417895e-03
5.700330472493399204e-04
1.843902731961137922e-02
6.601872251715995218e-03
2.115755947461917062e-03
6.966648837151199038e-04
3.465917637038510701e-04
1.018272068063454040e-04
1.291222199287624792e-05
2.413701967945548288e-06
3.467980812390227592e-06
6.651035635788680837e-03
3.205422762490473844e-03
3.698701957281724101e-02
2.547227546483285879e-02
1.999719401087006812e-02
1.425155621309900922e-02
9.791979584339896917e-03
6.558481046215938748e-03
4.313579298937699792e-03
2.828168329739468197e-03
1.876531043722708039e-03
4.300095858659726961e-03
1.939609020166541305e-03
2.620417055197227577e-02
1.562538722799382968e-02
1.105948253550742902e-02
6.965424102897859078e-03
4.169778454859714850e-03
2.472777642839935151e-03
1.432773830246230956e-03
8.116405652979261738e-04
4.349917666021214870e-04
2.866344068887995405e-03
9.278699262700169622e-04
1.930791288509041762e-02
1.022414273195837442e-02
6.371852254575392782e-03
3.789228894463511459e-03
1.964111269610518962e-03
9.963110217271261160e-04
5.261628068061303086e-04
2.577723260663765067e-04
1.313682225652458080e-04
1.937975452976869973e-03
4.881826251482385506e-04
1.431874004739152467e-02
7.362969912554351119e-03
3.751933125683236218e-03
2.087759401252451633e-03
1.128251175206642417e-03
4.581698803356149224e-04
2.000097788997035400e-04
1.111582799179212212e-04
4.871005707678722509e-05
1.338717860535527720e-03
7.717678613604730996e-04
1.048600090261060484e-02
5.576130378332677141e-03
2.605485561697201604e-03
9.700143148432726009e-04
6.340167319052949927e-04
3.113011055649735309e-04
7.790237406364365375e-05
2.378975886564594291e-05
1.970775359664482694e-05
2.275292085331511328e-03
6.940112587454800317e-04
1.744131056020792672e-02
1.346024894097054732e-02
1.193595760103845910e-02
9.780453530973128029e-03
7.371355723189096723e-03
5.474280495257209146e-03
4.008901378041926367e-03
2.858360973983240308e-03
2.034020370887779355e-03
1.626703018905815241e-03
4.959724654871561049e-04
1.259865346293027356e-02
9.089740067784096711e-03
6.831993020213479942e-03
5.196230857029000318e-03
3.603883436861360021e-03
2.271119831587345254e-03
1.496264867811746046e-03
9.874446791108605105e-04
6.101009990645427138e-04
1.085283437827586940e-03
5.497733674738597550e-04
9.036116195765598463e-03
6.463866894506658384e-03
4.260802028384188395e-03
2.690237250719743848e-03
1.937376482431017862e-03
1.109456702989921901e-03
5.631353337726843853e-04
3.398103326436153582e-04
2.104851944715704405e-04
7.400270426700468387e-04
8.327425799547327062e-04
6.630655525375981491e-03
4.498421497430156804e-03
3.096155655901287017e-03
1.402073046798599058e-03
9.211308868612471312e-04
6.721681797400891377e-04
2.958231791975045083e-04
1.074887527376195621e-04
7.156957214119902017e-05
8.423214718932053261e-04
2.321491267591407708e-04
8.300622547765439466e-03
7.861256059095187571e-03
7.121503414846372046e-03
6.263400159891603994e-03
5.491606806345994754e-03
4.274164306189208104e-03
3.268231120557002229e-03
2.570207776853789764e-03
1.968114254608962360e-03
5.876303058491980829e-04
5.170580504783722775e-04
6.069364433313757974e-03
5.406280399179438922e-03
4.745690004354733912e-03
3.358287246640119083e-03
2.782180727021975157e-03
2.144290272650737576e-03
1.376563107036273209e-03
9.252156223982885720e-04
6.816624659239284333e-04
4.461183948489411003e-04
7.137459820255978886e-04
4.635994043525267644e-03
3.584136577012881839e-03
3.333551772813426670e-03
2.037690457819323238e-03
1.288503281115570363e-03
1.100576152228592607e-03
7.359101052785359904e-04
3.558845421510131528e-04
2.074254772518607391e-04
