1.088349999999999929e+00
3.565500000000000336e-01
3.852249999999999730e+00
8.863093015720070744e-02
7.565304474735644324e-02
1.540773379322055159e-01
8.928177558551358972e-02
5.968361838437875877e-02
3.633839289049967114e-02
2.094132956545922616e-02
1.229285828146180204e-02
7.186454416912569677e-03
4.106496827169099986e-03
2.170930607413134716e-03
4.456110898870648679e-02
3.126886265165086665e-02
9.180023773649340080e-02
4.527215128702825192e-02
2.465751352195337184e-02
1.493001601087144518e-02
7.699402403914310140e-03
3.375261643265925395e-03
1.614672421688729664e-03
8.015793521431115089e-04
3.006488255545809534e-04
2.536708698201615292e-02
1.338142653407237495e-02
5.601312985528434513e-02
3.037444946742148127e-02
1.185257375198383797e-02
4.570307807531591958e-03
3.384005609256268091e-03
1.649704062566316378e-03
4.630457717162376075e-04
1.468471498088124078e-04
9.018556450020807078e-05
2.039630141766710439e-02
8.773462894988696970e-03
3.091992194087366322e-02
1.923208744799958028e-02
1.151987391086175053e-02
2.036900053415606916e-03
-2.069501219067217124e-04
6.660252501724727922e-04
5.451613269240003024e-04
6.847952619004946508e-05
-1.264271478335186854e-05
1.704773066556047531e-02
6.569903122142990368e-03
1.883385520486687698e-02
6.004238289095418894e-03
7.472714669468938711e-03
4.602443757020496101e-03
5.419276006175291179e-04
-7.065713709999591830e-04
-1.728882682617987091e-04
2.013815186486077465e-04
1.066186535296698216e-04
8.066613416678771603e-03
6.374788611092135383e-03
1.881579031677735672e-02
9.056670584068405357e-04
1.038766036545950262e-04
1.956718738287511073e-03
1.754397880261453994e-03
5.729060915966163389e-04
-1.187076359119549707e-04
-1.950066101699790869e-04
-5.247447147546331137e-05
2.255672877701929771e-02
2.293263438326020517e-02
5.901440756962111206e-02
4.422721407661608234e-02
3.152823606842167919e-02
2.349019428600377865e-02
1.731410371517545788e-02
1.097649518759499614e-02
6.841205099212810219e-03
4.546945880988411716e-03
3.089066636911434304e-03
1.220819489171700266e-02
1.200785063774625905e-02
3.326823927736224235e-02
2.495740676547514650e-02
1.683601864527890443e-02
8.507763793814437578e-03
6.162404320065395860e-03
4.693162981741203811e-03
2.381011514383829086e-03
1.096268797293119398e-03
6.513277001941481523e-04
9.120573786531643509e-03
8.063963091063656996e-03
1.984707988993452896e-02
1.366547870179140103e-02
1.148794746014303488e-02
5.126628230252813605e-03
1.054990353188670592e-03
1.015694674367713509e-03
1.340898406838860650e-03
5.969517865194461136e-04
3.027416890400291426e-05
7.055306001109447507e-03
4.243918434484343638e-03
1.304980446575428922e-02
6.131976072878874730e-03
6.602094913628593111e-03
5.102622121423809609e-03
1.546046230314763927e-03
-4.446541950195246197e-04
-2.543327455582625510e-04
3.739889331742129357e-04
3.623975705942244639e-04
3.140416580910772651e-03
2.206755158315034174e-03
1.076040929692191964e-02
2.486638922693311729e-03
1.624317654508330251e-03
2.627706120399793052e-03
2.289994576357803121e-03
7.821440541498873985e-04
-2.597239520167800319e-04
-3.842811191818286745e-04
-9.304866850681526051e-05
6.913209521577268375e-03
9.858149896794612607e-03
2.362023233118759960e-02
2.069573117384019417e-02
1.948551039161820764e-02
1.419384285926483281e-02
1.033372320819775543e-02
8.790798298454428547e-03
6.719590033638962387e-03
4.239174484854034593e-03
2.815680058711040028e-03
5.013054026671871603e-03
6.401680880430662274e-03
1.454485886369662542e-02
1.109379556693703729e-02
1.087139101159510964e-02
7.881859647221165291e-03
4.050250889413930556e-03
2.501342949380834513e-03
2.448890395674588587e-03
1.950931984312221507e-03
9.509199869762151053e-04
3.594943499224725544e-03
3.052679577083968268e-03
9.571407563224469325e-03
5.959352759669246137e-03
5.800369703108144287e-03
5.115711824605995682e-03
2.737924569663938504e-03
5.778357272565626561e-04
1.169335382273659692e-04
5.096467129645033999e-04
6.138960896826214150e-04
1.536929434402488836e-03
1.067263577472126477e-03
7.217447952227121037e-03
3.315537183920396619e-03
2.565126684109948849e-03
2.752098660090206584e-03
2.389074375473539125e-03
1.068745414488300738e-03
-7.825238238908210475e-05
-3.104000428813645930e-04
-2.083582874463613840e-05
3.167556643069774271e-03
5.118264279543142947e-03
1.136195322994669986e-02
1.006033283046333521e-02
1.067044220154168312e-02
9.976529034341442490e-03
7.565350513582762455e-03
5.447854270180789438e-03
4.612025052547593512e-03
4.044592921852214855e-03
3.078190409583722153e-03
2.094515767191220627e-03
2.353928354907600193e-03
7.273296765779729833e-03
5.647383637500743778e-03
5.609680990619288557e-03
5.353288937690928694e-03
4.117755293824880945e-03
2.285712122305526457e-03
1.262301018578444733e-03
1.178161377888106709e-03
1.165401527348889320e-03
8.741852326849705547e-04
6.613771770113737597e-04
5.157591859287082026e-03
3.380274667911136073e-03
2.892812020014120817e-03
2.782513495752514474e-03
2.429988491817331765e-03
1.532826356217850943e-03
4.814370479305410790e-04
3.399832536118259851e-05
1.542208656709180027e-04
