7.013499999999999179e-01
1.441550000000000109e+00
3.648249999999999993e+00
7.424165212389769453e-01
4.757745402310230576e-01
9.498703991187877893e-01
5.282250212151606839e-01
3.313018067986678861e-01
1.950720692119355948e-01
1.142956005023613997e-01
6.778770010688585368e-02
3.742894553189133472e-02
1.792742909736584969e-02
9.312050677973460894e-03
4.359610906585103529e-01
2.527365985351680555e-01
5.953290623878746413e-01
2.850702844062329433e-01
1.588948770449409020e-01
8.132702900747064423e-02
3.960353841616457565e-02
1.791557944321099313e-02
8.503619475789803844e-03
5.161205605739986255e-03
2.935517470875834319e-03
2.662156607077855730e-01
1.441002557322628441e-01
4.041114327538956608e-01
1.700457875140173880e-01
8.520605470480499544e-02
3.812962878549665952e-02
1.699468032754142960e-02
7.752753539698604632e-03
3.393542840113421798e-03
1.121106904387448146e-03
2.390910204483101510e-04
1.662982189540667954e-01
8.653177526165085898e-02
2.907753405954947024e-01
1.092627047678161878e-01
5.128916450821334461e-02
2.063415507718158182e-02
7.883105232329337686e-03
2.896201785414577283e-03
1.093299419141189688e-03
4.609779472461450218e-04
2.014088148532445653e-04
1.051584647154485824e-01
5.220493219839511534e-02
2.194806017727932712e-01
7.251828629644903323e-02
3.247272034963980675e-02
1.215420216727622869e-02
4.255193897382922308e-03
1.541241144774833233e-03
4.490771788283974401e-04
1.143879901104162766e-04
5.681353186497503519e-05
6.820533700710873504e-02
2.848968999138510108e-02
1.730083587477844465e-01
5.122027915827170874e-02
1.999616454402293117e-02
7.916026559650367334e-03
2.381765888149007127e-03
5.854364417980979394e-04
3.018997861060302638e-04
1.390562977458870055e-04
1.436820865659571487e-05
2.281650709738634597e-01
1.901624350557450938e-01
4.322784140994835878e-01
2.899270123426780921e-01
2.143001729212603568e-01
1.477911316263052499e-01
9.925677797023362003e-02
6.553128273372910151e-02
4.350503014631597332e-02
2.919589112248188040e-02
1.801103419343244930e-02
1.379472534639909764e-01
1.061638727646285196e-01
2.798726477083576802e-01
1.657375577485789842e-01
1.115157573636369609e-01
6.818399432255414783e-02
4.051319647737327417e-02
2.340109140686221639e-02
1.269510556413685001e-02
6.334830646476802274e-03
3.570786277697590022e-03
8.603361498865316759e-02
6.170745136088628263e-02
1.947227385327600924e-01
1.015698796452021019e-01
6.365826202867203021e-02
3.464361424977412812e-02
1.803676756696416875e-02
9.358739960281145867e-03
4.994130610909339879e-03
2.880118289703252361e-03
1.449199208877656898e-03
5.523528918459431891e-02
3.522052860076997638e-02
1.440555664838161498e-01
6.620893569363699160e-02
3.848071566459670273e-02
2.048448403710643323e-02
9.280550490415939019e-03
4.269340401732281062e-03
1.948583907905094463e-03
6.780553089912616125e-04
3.210537973726526237e-04
3.665985055779083512e-02
1.894654063557969087e-02
1.096847611129553174e-01
4.750009411120015984e-02
2.259990227908999227e-02
1.220708541857806230e-02
5.758554422887818443e-03
2.033327834608285832e-03
8.833934839430971882e-04
5.391875082649344800e-04
1.685528865381934237e-04
8.217320795871402295e-02
8.214904893191166124e-02
2.130048798364505280e-01
1.607661680285353278e-01
1.347957743966285427e-01
1.030553138952690073e-01
7.652325735434442611e-02
5.582838597317957979e-02
4.020652104622916834e-02
2.882456500621978848e-02
2.066086978732161947e-02
5.155317879382499691e-02
4.610651356681571417e-02
1.441691774473386756e-01
9.611105570234523832e-02
7.476897112984910720e-02
5.272060779568894795e-02
3.446524130798734459e-02
2.265976110519633130e-02
1.454552107743607194e-02
8.886652504948213543e-03
5.237345659802245847e-03
3.344843365372360267e-02
2.583239426662953947e-02
1.026625903161873382e-01
6.249378835902024559e-02
4.287443300298106330e-02
2.921917961290637286e-02
1.734491068745466769e-02
9.480543415308415392e-03
5.629900101932041115e-03
3.382241078838702300e-03
1.938814005899102029e-03
2.214778815247260210e-02
1.520904806600099045e-02
7.445076536221427455e-02
4.486877772415098775e-02
2.587752712193364113e-02
1.634346789390686561e-02
1.039618834927673319e-02
5.077962062271452852e-03
2.351591740158427701e-03
1.286031947572258268e-03
7.013554209119054507e-04
3.377356665108924294e-02
3.573064581690400116e-02
1.119081255565472638e-01
9.192647454111042837e-02
8.258022577099495554e-02
7.081382892987056477e-02
5.601573302356854800e-02
4.324047138655804506e-02
3.372991494541131147e-02
2.580129438155864471e-02
1.948123285704936661e-02
2.184431051674121452e-02
2.095974914201067033e-02
7.644750158569174614e-02
5.996705875388096824e-02
4.754667692876304169e-02
3.814371529378460246e-02
2.873580881736675224e-02
1.949588516774995728e-02
1.340281884777950322e-02
9.486918101002401321e-03
6.407753393613520657e-03
1.419635898139897344e-02
1.354067656935909088e-02
5.335754181742195790e-02
4.139205015470716342e-02
2.983573841030071061e-02
2.034164846997084733e-02
1.563995744454464709e-02
9.921881643050410246e-03
5.566674822484802242e-03
3.431263824539382019e-03
2.273418180966790304e-03
