1.152849999999999930e+00
1.374500000000000166e-01
3.651250000000000107e+00
4.052916733220986861e-02
3.386636631844390510e-02
8.670140535379937397e-02
4.996907674568364099e-02
3.375063887958169861e-02
2.153480099578462120e-02
1.238266332715220845e-02
7.123493915443672962e-03
4.234596709127493898e-03
2.469048002419883467e-03
1.411912230616157657e-03
2.024515653282524946e-02
1.334109038630410318e-02
5.132551500401412448e-02
2.737027139687787242e-02
1.382080131724931077e-02
8.187495738209746299e-03
4.901969496743312227e-03
2.227566081636460880e-03
9.603574896273935416e-04
4.992462409349776543e-04
2.577474185532862248e-04
1.253374641050010105e-02
7.059709586443447572e-03
2.977970543608070980e-02
1.794209663320451426e-02
8.776189210675550134e-03
2.228567583207728079e-03
1.359328505988801348e-03
1.164313033498826479e-03
4.211770350693998135e-04
7.019328186994188063e-05
2.888370124557148241e-05
1.086650066517512968e-02
4.871592223511720526e-03
1.685285246765047887e-02
8.694551930862971789e-03
7.393306657572477902e-03
2.843702931602243734e-03
-1.544374982724952300e-04
-2.172619276757868612e-04
2.794424609714197530e-04
2.034029522051638813e-04
3.065078474996865179e-06
6.756957449534688187e-03
3.222676675463284970e-03
1.299635534483767688e-02
2.102328951136044587e-03
2.332502715162983273e-03
2.703382979154075362e-03
1.298709017415357455e-03
3.078249099675891991e-06
-3.020759504395017429e-04
-9.476668358152932003e-05
5.892127161623852093e-05
1.583991530566260719e-03
3.323537416254167091e-03
1.350717751266238345e-02
1.945038882417474656e-03
-5.630323550340163860e-04
-2.801220943661441567e-05
5.861900143883289581e-04
4.975959886761801860e-04
1.767753855833961046e-04
-1.329567441518051508e-05
-5.193244046310810185e-05
9.999551133677831577e-03
1.061984534219404148e-02
3.103451916032982580e-02
2.453591228760347229e-02
1.827455796792265552e-02
1.263540485577227361e-02
9.866225229196267169e-03
6.795404874725868676e-03
4.076365178321223436e-03
2.590063036855883884e-03
1.749397930806312861e-03
5.865601289776722384e-03
6.307328922780537812e-03
1.793660490508658042e-02
1.320841443733677956e-02
1.048552978649705883e-02
5.357438340472782737e-03
2.816355171276278303e-03
2.494355351670775583e-03
1.743111768269833698e-03
7.422463257517117460e-04
3.414649475656332533e-04
4.696398952018311472e-03
3.816342196474310691e-03
1.115349967191573387e-02
6.745063954224468465e-03
6.406905848458419039e-03
4.023579595134533018e-03
1.078096265912852894e-03
7.620139304749132074e-05
4.294001544750651470e-04
5.488419570446775560e-04
1.949403500300843448e-04
2.687738965220429471e-03
1.406458021285053985e-03
8.061056293487332131e-03
3.067119147607098948e-03
2.721860747170457440e-03
2.831493187384319030e-03
1.680825535157363460e-03
2.255475602432775923e-04
-3.276307198515311181e-04
-1.297297844199400588e-04
1.426948530648493231e-04
6.387952281265437500e-04
9.925981340655855908e-04
7.011956139560017801e-03
1.873936228004387597e-03
4.616800524442202019e-04
6.713655040138724606e-04
1.053143371436305199e-03
7.999880721942235389e-04
2.372952897962437484e-04
-1.108328360571080105e-04
-1.558474481709381870e-04
3.338936477906663276e-03
4.959201110561725460e-03
1.272862582875353664e-02
1.072283595051688743e-02
1.083169242283698284e-02
8.576504012889738307e-03
5.834331157745309762e-03
4.580401363558885691e-03
3.933457184309035494e-03
2.817983550269818893e-03
1.700444002274973353e-03
2.517922569463855974e-03
2.893253267696800635e-03
7.984889663381863553e-03
5.806105205879590926e-03
5.718816109346345176e-03
4.816387476598932293e-03
2.789265343528639536e-03
1.283438562705948921e-03
9.908571154387756617e-04
1.043338127510348408e-03
7.689056067029188726e-04
1.335903715090515061e-03
8.687072609206508917e-04
5.525791099885259301e-03
3.244598792399971607e-03
2.837168628205630899e-03
2.711486013072027766e-03
1.998333155385080811e-03
7.801403184158218346e-04
3.077846219380802256e-05
1.673192279885644916e-05
2.261818210413362048e-04
3.481230339340901712e-04
3.733026088134546719e-04
4.319188953760783739e-03
2.020339429163503248e-03
1.237936129522959009e-03
1.148311280610711266e-03
1.193310230996660328e-03
8.916942768068895344e-04
2.966244247510683540e-04
-1.162720835243734535e-04
-1.622555367329574878e-04
1.551676653560746634e-03
2.301568636868337077e-03
6.065834861393874615e-03
5.344151513867783504e-03
5.638747777411211304e-03
5.557027099058464530e-03
4.614916097115459061e-03
3.236404669612339118e-03
2.429407132887198822e-03
2.156014355524215470e-03
1.850021988225077811e-03
7.451599981352278025e-04
5.915657257667950291e-04
3.933875528485689110e-03
3.005088649942596647e-03
2.846203463305016154e-03
2.756031710481360308e-03
2.378232850788556448e-03
1.587615078403906751e-03
7.793641170604155609e-04
4.665063744764461041e-04
4.922544288648046922e-04
2.340700018826331961e-04
2.122395134446677489e-04
2.931731038385398079e-03
1.963215771504450095e-03
1.583719113431471389e-03
1.382253723240087998e-03
1.282929199216855396e-03
9.983700025410291792e-04
5.368225548317821392e-04
1.197612390378287095e-04
-1.001749672855424691e-05
