1.249449999999999950e+00
6.568500000000000449e-01
2.812749999999999861e+00
4.226054151866527088e-03
2.250157125411996351e-03
2.263711811429231988e-02
1.401497330345710148e-02
9.131394171601621076e-03
6.132193631628984551e-03
3.846184384625280731e-03
2.139593063091851152e-03
1.241958034890002383e-03
7.542848898326172348e-04
4.356174593956369423e-04
2.218504429428857540e-03
1.719230742487742923e-03
1.351375803783494249e-02
8.215878669121757377e-03
4.721303926030954654e-03
2.054300315517170773e-03
1.329817881337999825e-03
8.380939302714591902e-04
3.358672311531203550e-04
1.250777240072981739e-04
7.885197533858589103e-05
1.667198451404784156e-03
1.700052959559782183e-03
8.506203037983110088e-03
4.362225968692307748e-03
3.221156226521086369e-03
1.277608511996942628e-03
1.724844349249010362e-04
1.433267317115792831e-04
2.153428995641072988e-04
9.400283645705704617e-05
-6.164142835881915081e-07
1.054827851771304465e-03
1.130331124555887729e-04
6.034536361838715307e-03
1.998281793764321388e-03
1.540536959603127547e-03
1.182178386888091100e-03
4.347186704450293625e-04
-6.330376406284652106e-05
-1.019296174499799721e-04
1.128775130942177416e-05
4.717820531785320163e-05
2.558568073507543365e-04
-2.449560115063820600e-04
5.036981209916811635e-03
1.130886524666541116e-03
2.621318658597849411e-04
3.180450486028052470e-04
3.854777203329872240e-04
2.264896583175756296e-04
4.164382546061278065e-05
-3.744425341116418678e-05
-3.227460127824918512e-05
-8.988078531300284569e-05
2.181907844466958294e-04
4.442928185961377008e-03
1.230287008294960686e-03
1.619549742139919906e-04
-1.226102175943755081e-04
-5.703428331625675648e-05
3.291281993729327246e-05
5.576695334236718139e-05
3.559119053628492264e-05
1.091987315079959789e-05
1.016116610758009990e-03
1.413707513996420454e-03
7.534189167177436988e-03
5.934475578953255816e-03
5.495878798590170602e-03
3.628501271506551305e-03
2.418812505179684762e-03
2.002829719788886721e-03
1.420868287215505546e-03
7.994455022998038290e-04
4.883023926551177587e-04
8.169651113568562537e-04
1.220157739195525679e-03
5.007898850277605479e-03
3.143364252869996697e-03
2.903847452602918450e-03
2.072574981259958041e-03
9.246146942542708604e-04
4.137055689575721879e-04
4.286428060215061783e-04
3.653053557603555416e-04
1.544048894493028868e-04
4.368269781784347040e-04
2.794378753691423200e-05
3.489522154896666350e-03
1.795086559500272058e-03
1.386961411757478080e-03
1.196081994225571977e-03
7.169275308498178952e-04
1.676675413935669733e-04
-4.553242371312651919e-05
2.573906136510880404e-05
1.046377808947045797e-04
8.868639842869597135e-05
-2.927804734981814447e-04
2.684177198469267327e-03
1.136268897895157054e-03
6.101492830197320421e-04
5.035667993334622637e-04
4.834184808418548300e-04
2.994466465349707759e-04
5.735108928132848536e-05
-6.842503901619069223e-05
-6.068952527241773965e-05
-2.618918880130649066e-05
-3.568502607261707561e-05
2.137374494900022483e-03
8.016124494392347930e-04
2.470121378043268817e-04
5.112470573372298731e-05
9.565560388195514766e-05
1.610587498399166956e-04
1.456750164302323682e-04
7.266842205948268938e-05
6.083991109639328973e-06
4.948072367124342619e-04
8.606195795977389113e-04
3.272169064858519716e-03
2.579621816190719868e-03
2.667189769567344677e-03
2.568363708634587364e-03
1.917153516848522530e-03
1.205615930605703767e-03
9.237058405007321981e-04
8.607162617013410216e-04
6.740476198340299065e-04
2.161801917359613436e-04
-4.996878227603923131e-07
2.180058574782368312e-03
1.534559822463195866e-03
1.315618294229948301e-03
1.220944934290108235e-03
1.009518911306794397e-03
5.766387783712424372e-04
2.218915937824628354e-04
1.327481139986810160e-04
1.786745584262839780e-04
4.556190121550968239e-05
-2.123637846370666907e-04
1.631665648329237760e-03
1.022092505536119095e-03
7.331772861267423121e-04
5.738635384867336962e-04
5.109436568842283576e-04
3.801347624281143658e-04
1.656704806542239191e-04
2.487802431534634656e-06
-3.050417080982142077e-05
6.066045232641601829e-06
-4.369996680649775055e-05
1.236467088001748675e-03
6.885286297917580156e-04
4.282795369626432374e-04
2.611766769840379010e-04
2.276693275424533159e-04
2.223295379297916721e-04
1.694536804255109843e-04
7.220079951175006503e-05
-1.286574793142219408e-05
1.039859052310578252e-04
-3.624909007422743272e-05
1.417941196102391523e-03
1.277182948384005196e-03
1.282542886155945512e-03
1.310774198836631415e-03
1.295888196100918304e-03
1.072690362969867112e-03
7.216712524012212438e-04
4.865706180891019527e-04
4.305345730899166629e-04
1.685486260262392092e-05
-1.721891537800551513e-04
1.037557927298812755e-03
8.420208238916717563e-04
7.443288255801576696e-04
6.316333820128608402e-04
5.888122755951454186e-04
5.191977065851964904e-04
3.646539526254319818e-04
1.816872236992792987e-04
7.332635388961613405e-05
2.228654412796003865e-05
-1.601585619257945244e-05
8.034776466263955814e-04
5.959189191140109969e-04
4.961794985034799444e-04
3.624790496992586755e-04
2.873891179990380402e-04
2.522180595736321770e-04
2.003934677290503325e-04
1.168960900731281827e-04
3.289480403578132103e-05
