1.132749999999999924e+00
3.418499999999999872e-01
2.229250000000000398e+00
1.822168104661851980e-03
6.445156968990455428e-04
1.248736452950477936e-02
7.358691180851598991e-03
5.003741472759950029e-03
3.235095305322129456e-03
1.909101251416204332e-03
1.120256723155785283e-03
6.635341079212599483e-04
3.814679579958782352e-04
2.167647959167273686e-04
1.028378726595331359e-03
3.023570315177641528e-04
8.015090686841390075e-03
4.410946273867856135e-03
2.307893436485754755e-03
1.304032493065482648e-03
7.601309415722640878e-04
3.445361577710477413e-04
1.547485064663260885e-04
8.544018360597473876e-05
4.304970152861357555e-05
6.312024776386853091e-04
6.044578641185989172e-04
5.132494194936161429e-03
2.800017891296099123e-03
1.467159884595870293e-03
4.573465938418919694e-04
2.480826532378270044e-04
1.828683197459209683e-04
6.520789585108653782e-05
9.507518006288497215e-06
5.508460769422465475e-06
5.110874119907517568e-04
5.452524664319309241e-04
3.474839849724712867e-03
1.518986968151974986e-03
1.069967805284327295e-03
4.117584435231176165e-04
1.071509532093073429e-05
-2.646155325797894244e-06
4.696137545143073473e-05
2.789314467884014518e-05
5.380704808024147927e-07
2.867730033914112704e-04
-1.206501151992747667e-04
2.635836842817606412e-03
7.333853818846237764e-04
4.891798431139112195e-04
3.892961398439276377e-04
1.519212606665212839e-04
-1.723491142251330543e-05
-3.850432714933551745e-05
-4.661270864646341123e-06
1.047115999726147256e-05
6.492483079420159912e-05
-1.923158992439250687e-04
2.257308483907439697e-03
4.524499273071236707e-04
5.955626346559851695e-05
8.397379138902580798e-05
1.176529161830467914e-04
7.211109139591514289e-05
1.590532859641078384e-05
-8.778808011025575383e-06
-8.655755603458920952e-06
4.423586689986385052e-04
3.175565614884079402e-04
4.278200909050031663e-03
3.529808351453221724e-03
2.780219625389897427e-03
1.895243431936489628e-03
1.495357498395824070e-03
1.064970319438475173e-03
6.471542012821579785e-04
4.209103501003286989e-04
2.968208833158896107e-04
3.013709875094611082e-04
5.114533989047265628e-04
2.870819175038829933e-03
1.972987224567717118e-03
1.676606358815108241e-03
9.204015755350489257e-04
4.676470480577213395e-04
3.889548160129420082e-04
2.740349400805943011e-04
1.164601888250344722e-04
4.773585784845371340e-05
2.544393283281882806e-04
3.869383573254784247e-04
2.039463298336656634e-03
1.107222585755729665e-03
9.415926868305929355e-04
6.322142615956669780e-04
2.159461879827471889e-04
4.429534147700843526e-05
7.682915412447825472e-05
8.464390961929054390e-05
3.114648998381975642e-05
1.162170242723041259e-04
-1.009954418651448741e-04
1.521037702138310207e-03
6.791226653300466926e-04
4.621968947715393637e-04
3.929265413569183710e-04
2.256009936219015896e-04
3.354203633202674774e-05
-3.758179654046336053e-05
-7.502487833338567510e-06
2.590417524072268434e-05
1.480567643719358805e-05
-1.840185253425899177e-04
1.205008332122711311e-03
4.482656719102048751e-04
1.982908125395350864e-04
1.643569591552046115e-04
1.658664713985786470e-04
1.023649256424619559e-04
1.843325911396395271e-05
-2.446433470650115723e-05
-2.216254468025325466e-05
1.731066592101164448e-04
3.403436637502456341e-04
1.850788646442290018e-03
1.485086737927234987e-03
1.620979692900115362e-03
1.371632797219530207e-03
9.125334640026134441e-04
6.993905451038415514e-04
6.302491079368852762e-04
4.664176852875270320e-04
2.784525495082408272e-04
1.604384953025970572e-04
2.753406843082277619e-04
1.323316595201421515e-03
9.083377605059141579e-04
8.494944650005887155e-04
7.670965901846285876e-04
4.932206372324559815e-04
2.289991194476940529e-04
1.542343168591478345e-04
1.672078925312337893e-04
1.286455599327390492e-04
5.633056386314998980e-05
-7.889408186082568831e-05
9.493248182559501725e-04
5.873027015901848696e-04
4.401702608028830693e-04
3.903381780085434004e-04
3.052227653289384200e-04
1.436962395993846996e-04
2.365659062234865473e-05
6.856817315611647957e-06
3.680927883983631807e-05
7.033612171115442209e-06
-1.288567219825293450e-04
7.389881952055344554e-04
4.139754853900596545e-04
2.589608258791151782e-04
1.913907515174279007e-04
1.710778098063577967e-04
1.199704974428801054e-04
3.948687672161304711e-05
-1.536224538868154893e-05
-2.120976828763068510e-05
1.061604552875751375e-04
1.925199817193575717e-04
8.972192777670925197e-04
7.723596664273767393e-04
8.022785654585662743e-04
8.472241341595089601e-04
7.529262745249345849e-04
5.305802796505896916e-04
3.727132915754744250e-04
3.355087821380757008e-04
3.135925693712614715e-04
2.537495700577813268e-05
-6.989340413187044123e-05
6.204369283325895457e-04
4.941442356460355257e-04
4.338313588259360060e-04
4.119364228957762396e-04
3.868647955695635708e-04
2.826965984886742334e-04
1.460839218998848587e-04
7.351647962404770460e-05
7.266033521386628020e-05
2.024612587219904665e-06
-9.512575680984507989e-05
4.802890887935058685e-04
3.520523888300983780e-04
2.720941300062898189e-04
2.109518404944445711e-04
1.890992167106209923e-04
1.582348181720098681e-04
9.475910417944604042e-05
2.861046518909768382e-05
-3.303577823188956782e-07
