9.845500000000000362e-01
2.788499999999999868e-01
2.121249999999999858e+00
3.102746568465645192e-03
1.337693062766340778e-03
1.760818429454190717e-02
1.032720197618650255e-02
6.914270089584782439e-03
4.262453237566185722e-03
2.540511320989631214e-03
1.487164720806065680e-03
8.521710302488519091e-04
4.784668061883444175e-04
2.701421354149144329e-04
1.785430948953313892e-03
6.000373275794567123e-04
1.183185936364093867e-02
5.855834911955080761e-03
3.387352446118751040e-03
1.849030687272508857e-03
9.104072482365155577e-04
4.509893373582158000e-04
2.242033658803739256e-04
1.082824229547386604e-04
5.555537240607833204e-05
1.080079902225917089e-03
2.248052946570168985e-04
8.223013110696454978e-03
3.789788557375031643e-03
1.705422119500147682e-03
8.756246852019959224e-04
4.281876488247764699e-04
1.578578780580841036e-04
6.522553718457614527e-05
3.436088474407524669e-05
1.384129201081205934e-05
7.082370056429512914e-04
4.295341693372864054e-04
5.601690057994461111e-03
2.698382833659536840e-03
1.094432831994603421e-03
3.116217816518334184e-04
1.945236024429979071e-04
1.045927145418143120e-04
2.268128209656685506e-05
2.229235615771000197e-06
2.835752331703635778e-06
5.867371930354623333e-04
5.863880684508666896e-04
3.843737338415261374e-03
1.683390016749123676e-03
9.567950529836010982e-04
2.179752777934144373e-04
-1.184223203987623839e-05
3.081102697719554284e-05
3.555591686025513830e-05
7.042801523996496417e-06
-2.726022998970097117e-06
4.385581810439516111e-04
9.933298240807344678e-05
2.882609741006845680e-03
8.347080548018708098e-04
6.044182485201726610e-04
3.337347220064487956e-04
4.462612328428108166e-05
-4.242118764880701464e-05
-1.200208591537258913e-05
1.005336052467865859e-05
6.524961206464723234e-06
8.454160744040196051e-04
2.090124011868567497e-04
6.846898322379918467e-03
4.963746557540903853e-03
3.803268826651804140e-03
2.929212776257014011e-03
2.046013890830257823e-03
1.344679143751231938e-03
9.106164867797032943e-04
6.055038113922963077e-04
3.861709200538134337e-04
5.166122350511227236e-04
2.508135626642502740e-04
4.528016194859519304e-03
3.199922111298560221e-03
2.050095780240455186e-03
1.270523140988131941e-03
9.038458125685843760e-04
5.200163125187235629e-04
2.624818170456726107e-04
1.570471042820277042e-04
9.789642016699070387e-05
3.346606479693648752e-04
4.468855525077413825e-04
3.099427381665488795e-03
2.008911774682071907e-03
1.376502348612261171e-03
5.810864383096212091e-04
3.221892662570457772e-04
2.615580463479401938e-04
1.275891836012899884e-04
3.646240863096143601e-05
1.951006158632741209e-05
2.869309025185858182e-04
4.665399988463983603e-04
2.260003270270339107e-03
1.184742064925333252e-03
9.350834613682309105e-04
4.503048736490624401e-04
8.185680566033049291e-05
4.547703621419018049e-05
8.045412643900591153e-05
4.218254389106611328e-05
6.812494033407847479e-07
1.921859146145911662e-04
6.009508810615212101e-05
1.730083129762751857e-03
7.081940333671505033e-04
5.294535014625478516e-04
3.826088632210397265e-04
1.250950999903677999e-04
-2.880277441411290050e-05
-2.140949218159847713e-05
2.169147171379397476e-05
2.282775874924900436e-05
2.337992487312513638e-04
2.138621449795172083e-04
2.749692416146064418e-03
2.524857013864267950e-03
2.333851205655083742e-03
1.713617992522442450e-03
1.427101737358692397e-03
1.165735274478217490e-03
7.995071487929895134e-04
5.487911244717917853e-04
4.133055864186465397e-04
1.892791766651658015e-04
3.486866605325549375e-04
2.004715803687951922e-03
1.509600945768305299e-03
1.454674074674055335e-03
9.618687158271593211e-04
5.529807304272256561e-04
4.565339025569137700e-04
3.572417077294625493e-04
1.894320708860975136e-04
9.314407748285245152e-05
1.809484317335926184e-04
3.445183331501823379e-04
1.496196460156804355e-03
9.282405203507449040e-04
8.521614124344650950e-04
6.351563479382154589e-04
2.851284770028687343e-04
1.156709031192604557e-04
1.257363474717757348e-04
1.145640362948907950e-04
4.688694209722663774e-05
1.059796155776183350e-04
3.784289593489893034e-05
1.124934022880992417e-03
6.099416853272072222e-04
4.687647869799569907e-04
3.996963599493488675e-04
2.279503636988048352e-04
4.804431118098948059e-05
-5.744218718150837427e-06
2.678869250921550772e-05
4.345450592411482496e-05
1.111714629310159731e-04
2.161339496302534737e-04
1.380253017356009330e-03
1.182509164093037326e-03
1.371592586734646148e-03
1.263415012558827613e-03
9.254215653801913964e-04
7.444607110441600313e-04
6.890659293687398336e-04
5.491345315460265455e-04
3.664073077492971463e-04
1.283954018470197505e-04
2.569969765616199309e-04
1.053383960623160628e-03
7.914848773589001170e-04
7.938626428676013799e-04
7.539395172729622223e-04
5.278326514890313396e-04
2.975088737797458084e-04
2.257534669598049756e-04
2.215485257191588395e-04
1.646503108680622668e-04
6.452772034206682582e-05
2.396138854622415583e-05
7.671068325214189200e-04
5.301522975820737718e-04
4.436898130996717263e-04
4.167369150800453916e-04
3.276126495283242126e-04
1.652950338474894632e-04
5.710482575215414160e-05
4.783973732865172776e-05
6.771736933596217954e-05
