9.524500000000000188e-01
9.592499999999999361e-01
3.709750000000000103e+00
1.552330993712603968e-01
1.201162105578336137e-01
2.622726027072938004e-01
1.525711225389478065e-01
9.896641427051740270e-02
5.950050932675754467e-02
3.497619248997128200e-02
2.012718598828148325e-02
1.108092269144155158e-02
5.886074649713770451e-03
3.570218053578314531e-03
8.173465714078351207e-02
5.758689051930940966e-02
1.595895840397896503e-01
7.811029863593975386e-02
4.605059617440913911e-02
2.409360140925881355e-02
1.173257048123022873e-02
5.774626570788617477e-03
2.839873866358338071e-03
1.550437734595310358e-03
8.993185240778023932e-04
4.531042721358125719e-02
2.629464280100550153e-02
1.077432207704087375e-01
4.554167872044737053e-02
2.232016082541014163e-02
1.195112911595267412e-02
5.312467011903016303e-03
2.030822036380946268e-03
9.643695215077277040e-04
4.443086855617067710e-04
8.673455987863916427e-05
2.794641586553334167e-02
1.171988897413238015e-02
7.333305379770044263e-02
3.333850744118742326e-02
1.156033618137112390e-02
4.544402937764698697e-03
2.899040585483898206e-03
1.113923267426463522e-03
2.266262687707547383e-04
3.929076400397911835e-05
5.320033749172618093e-05
2.286418763518457964e-02
8.219537002769788589e-03
4.536297523110674468e-02
2.446057117160336386e-02
1.121005383151420579e-02
1.281640064954386177e-03
3.021001784796427110e-04
7.793338810868412911e-04
3.077522609724257481e-04
1.770419019176151855e-05
1.842463852037932648e-05
2.128289201520901577e-02
6.690178698735221342e-03
2.808127337443156943e-02
1.117662550046971334e-02
1.001649144983428677e-02
3.688212090213087175e-03
-3.605819059336705379e-04
-4.751033944410187415e-04
1.613492377196922684e-04
1.782230195371966805e-04
9.376870404166415463e-06
4.171322870388999987e-02
3.957290012075465740e-02
1.085059669835346241e-01
7.433945203940942048e-02
5.726830028021290958e-02
4.198210401816908355e-02
2.795678848064197738e-02
1.839440156547300295e-02
1.233153082357663251e-02
7.967404751253499492e-03
4.981467244525837786e-03
2.322935741318919375e-02
1.867260897770942757e-02
6.718914542057614903e-02
4.319349374264171842e-02
2.709408574079883239e-02
1.845311346499120542e-02
1.200435124121985130e-02
6.398461380886299316e-03
3.381157031324705069e-03
2.002305990977783137e-03
1.196912823716266699e-03
1.380550747964208111e-02
1.097832193008205399e-02
4.243640255757384627e-02
2.825971494396795416e-02
1.592706790630158548e-02
7.170246791537411048e-03
5.314467481452801040e-03
3.381658911792049475e-03
1.368993734627470390e-03
5.948610505747620658e-04
3.513349374539420774e-04
1.059052716397407279e-02
8.660934835978885415e-03
2.737053982971324878e-02
1.765303400769686892e-02
1.259156984915666549e-02
4.033018345729178118e-03
8.261735482306293296e-04
1.363351283989839733e-03
1.072450294638362285e-03
2.205504691417354093e-04
-1.236815165654510592e-05
9.190187716383992761e-03
5.344231032874619328e-03
1.858258069287747200e-02
9.053113445415627777e-03
8.899336311445229727e-03
4.977333311913295991e-03
5.365818770741815702e-04
-5.857327262307701230e-04
2.042318474680394327e-04
4.878220265434197035e-04
1.324651600576372149e-04
1.335366638607095660e-02
1.542788666456813666e-02
4.588356537096506538e-02
3.989469145554121882e-02
3.270756373421292856e-02
2.526219444777660222e-02
2.089996536972532626e-02
1.532055539924644799e-02
1.040967565605639689e-02
7.426881792764359128e-03
5.400549292461142258e-03
7.795087207979866858e-03
9.564315282162672016e-03
2.868688049622432693e-02
2.316738012001902727e-02
1.929862171399467780e-02
1.169679466216583252e-02
8.198310243179397078e-03
6.756187629101280921e-03
4.200571284715281031e-03
2.151992655017968825e-03
1.336376037953656074e-03
5.891253034268130809e-03
7.197373990388857695e-03
1.917976251547324346e-02
1.357970523753432822e-02
1.233800098723073467e-02
7.203279780099637597e-03
2.884402834793858925e-03
2.123457635747779976e-03
2.189811353008781769e-03
1.232208843293313262e-03
3.554960290740090010e-04
4.841756527720327517e-03
4.101384635924335345e-03
1.345879330913831579e-02
7.841067218394625477e-03
7.618178882817261757e-03
5.638171369679516147e-03
2.041348804699132970e-03
9.062347849799279125e-05
2.779448346317790210e-04
7.431908830960745832e-04
4.713197603379201120e-04
4.864179436870444927e-03
7.630105725845367191e-03
2.144192261952469758e-02
1.947363458175888073e-02
2.036078501965915555e-02
1.667164595639695004e-02
1.271045142933528715e-02
1.102761294966693277e-02
9.276232292292524093e-03
6.601021428259222674e-03
4.611492661318752385e-03
3.764281930689712327e-03
5.790501911765737544e-03
1.462466461189780575e-02
1.165976205127700061e-02
1.195924725400143718e-02
9.796162504838622914e-03
6.131347665723823823e-03
4.108498186693823086e-03
3.672924900778694410e-03
2.980728828266694577e-03
1.717602010070110692e-03
2.905738244975208679e-03
3.202348741688793975e-03
1.010656482913761811e-02
7.090432844763770899e-03
6.876614760725100611e-03
6.078067462143904240e-03
3.703823188023246029e-03
1.490902946452010193e-03
8.982152034801889210e-04
1.106744116419041508e-03
9.962668907207126740e-04
