9.371499999999999275e-01
5.567500000000000782e-01
3.318249999999999922e+00
6.897011904767433310e-02
5.008424444176071133e-02
1.421448543559110100e-01
8.232055508010016620e-02
5.370480383672919522e-02
3.258421691707122370e-02
1.922306129742452213e-02
1.105929068126158647e-02
6.121100965265394503e-03
3.356181464162788248e-03
2.074511196166467855e-03
3.682781975339015357e-02
2.437535589606652439e-02
8.927991803901147438e-02
4.381751376599350711e-02
2.560613627515766211e-02
1.342510755272044790e-02
6.631575968354760757e-03
3.284322854037182663e-03
1.636107826196481381e-03
8.802472571995287277e-04
4.602150373373316695e-04
2.062824673200316580e-02
1.129201833229137066e-02
6.135297512560263650e-02
2.605154937751413130e-02
1.292417278045970494e-02
6.711282337021358575e-03
2.915858355615023878e-03
1.158938386647864315e-03
5.455969405724389164e-04
2.222849311077285995e-04
4.860803783334600005e-05
1.260588022212519657e-02
5.164760136759238493e-03
4.284988741542102714e-02
1.865672442680246790e-02
6.738929636476375350e-03
2.850782555558176341e-03
1.619095035706662536e-03
5.731933740928305508e-04
1.215914003726797205e-04
4.305073275527459165e-05
4.642049882886189674e-05
9.864381782747622118e-03
3.965093386650012618e-03
2.804868191151729112e-02
1.390391639101903019e-02
5.801822720763770598e-03
8.217978549226971760e-04
3.758206444144489571e-04
4.380973991586782005e-04
1.413340716164497351e-04
1.030738202604056907e-05
5.595126005848789067e-06
9.271597375175952283e-03
3.177396664989148248e-03
1.815789091017473364e-02
7.451346516610847168e-03
5.433217253586176097e-03
1.640555098873379023e-03
-2.442009273195703341e-04
-1.376506215620524091e-04
1.269964995587762242e-04
7.394792944893985233e-05
-7.138586614261913254e-06
1.872112676869942122e-02
1.640365641246203932e-02
5.848977394292500381e-02
4.008867087130923296e-02
3.124965301151806304e-02
2.296313268229713267e-02
1.542973706602981422e-02
1.027484638260997910e-02
6.867697636329118602e-03
4.419364561686665339e-03
2.790273763246801930e-03
1.063304843368838119e-02
7.867003830980889151e-03
3.756778533583610136e-02
2.389144086639444220e-02
1.531335502563277787e-02
1.043587178727560169e-02
6.649657857660390414e-03
3.573117520365106693e-03
1.959400024828799637e-03
1.183304006062580382e-03
6.877861859400488578e-04
6.313407830198748336e-03
4.808470385287299045e-03
2.458668200967040196e-02
1.585067276265633707e-02
8.958298377009597108e-03
4.349028276166488557e-03
3.098886290001652381e-03
1.830332475772563543e-03
7.434251977307986719e-04
3.362239773251916104e-04
2.030209030025372104e-04
4.677134590185913487e-03
4.137553759955436665e-03
1.647949143115060369e-02
1.017391269760248990e-02
6.840953871043261268e-03
2.254935318756190292e-03
7.097912594956635448e-04
8.589038564836967357e-04
5.390860680484972113e-04
1.029173713742441865e-04
6.985859604060320499e-06
4.107488003632591041e-03
2.705896050351088052e-03
1.151252496015525012e-02
5.705956982198786588e-03
4.958971887120400962e-03
2.502800009609553941e-03
2.201409284757309946e-04
-1.815198704068964823e-04
2.138679647722095407e-04
2.421963694022748789e-04
3.785603944436660782e-05
6.063319613791295741e-03
6.417971778784525329e-03
2.494757435386745978e-02
2.155080014792135762e-02
1.786617428424544518e-02
1.408091350091922496e-02
1.161939470221543848e-02
8.496810688192342129e-03
5.853054288847173506e-03
4.220112996257761005e-03
3.076230343651875296e-03
3.571504456285170756e-03
4.228201859485840146e-03
1.622099720595638131e-02
1.293370560950009296e-02
1.073965472045708761e-02
6.647960817158860176e-03
4.776798623604292839e-03
3.796406411900735741e-03
2.302294419100501567e-03
1.224937783470467266e-03
7.823271494688047167e-04
2.662942302110480036e-03
3.440765773130873700e-03
1.122916272982926560e-02
7.799183630975111900e-03
6.919147731787457511e-03
4.047616645741761686e-03
1.761252054449126891e-03
1.357028195030951599e-03
1.238300937314537739e-03
6.334219698214393077e-04
2.000355949482029451e-04
2.229855632166929252e-03
2.106715855828085807e-03
8.052614883317795250e-03
4.713047552750621039e-03
4.327072655656397614e-03
3.055001177118038883e-03
1.098161652768945944e-03
1.438437056936022124e-04
2.714828345070491029e-04
4.317112889015771275e-04
2.116926892738901398e-04
2.193330456415596569e-03
3.280763158320392728e-03
1.175343469544111626e-02
1.061492688317817144e-02
1.123521057199697651e-02
9.252828177071041257e-03
7.164471072869280435e-03
6.284429802004522052e-03
5.212917858965367655e-03
3.695533255500707808e-03
2.643735081776294859e-03
1.731771758355789845e-03
2.733912432313756642e-03
8.327894256969779405e-03
6.556454404724628565e-03
6.722004078624114337e-03
5.512745915078786502e-03
3.493916440298230289e-03
2.405382905225084741e-03
2.138782381087880533e-03
1.660739450819334172e-03
9.274111808700884934e-04
1.383101260948945907e-03
1.653211469083799715e-03
5.914195020027919990e-03
4.143135495755154857e-03
3.946702569282034556e-03
3.436184370191924103e-03
2.090801131471563875e-03
9.083619476427644973e-04
5.993110476227447728e-04
6.799639339760399619e-04
5.529173145756185841e-04
