Quadts test:  Quadlevel =    11
Digits1 =   500  Digits2 =  1000  Epsilon1 =  -500  Epsilon2 = -1000
initqts: Tanh-sinh quadrature initialization
           0       24576
        1024       24576
        2048       24576
        3072       24576
        4096       24576
        5120       24576
        6144       24576
        7168       24576
        8192       24576
        9216       24576
       10240       24576
       11264       24576
       12288       24576
       13312       24576
       14336       24576
initqts: Table spaced used =   14938
initqes: Exp-sinh quadrature initialization
           0       24576
        1024       24576
        2048       24576
        3072       24576
        4096       24576
        5120       24576
        6144       24576
        7168       24576
        8192       24576
        9216       24576
       10240       24576
       11264       24576
       12288       24576
       13312       24576
       14336       24576
       15360       24576
initqes: Table spaced used =   16344
initqss: Sinh-sinh quadrature initialization
           0       24576
        1024       24576
        2048       24576
        3072       24576
        4096       24576
        5120       24576
        6144       24576
        7168       24576
        8192       24576
        9216       24576
       10240       24576
       11264       24576
       12288       24576
       13312       24576
       14336       24576
       15360       24576
initqss: Table spaced used =   16344
Quadrature initialization completed: cpu time =   15.699709

Continuous functions on finite intervals:

Problem 1: Int_0^1 t*log(1+t) dt = 1/4

quadts: Iteration  1 of 11; est error = 10^      0; approx value =
2.4996055656262656429379566503645027060409959384759122215497e-1                 
quadts: Iteration  2 of 11; est error = 10^      0; approx value =
2.4999999999628619317526003676928782334678886405662842306697e-1                 
quadts: Iteration  3 of 11; est error = 10^    -22; approx value =
2.4999999999999999999999940795411742893121357647002023916746e-1                 
quadts: Iteration  4 of 11; est error = 10^    -47; approx value =
2.4999999999999999999999999999999999999999999999999821716365e-1                 
quadts: Iteration  5 of 11; est error = 10^   -100; approx value =
2.5000000000000000000000000000000000000000000000000000000000e-1                 
quadts: Iteration  6 of 11; est error = 10^   -188; approx value =
2.5000000000000000000000000000000000000000000000000000000000e-1                 
quadts: Iteration  7 of 11; est error = 10^   -389; approx value =
2.5000000000000000000000000000000000000000000000000000000000e-1                 
quadts: Iteration  8 of 11; est error = 10^   -501; approx value =
2.5000000000000000000000000000000000000000000000000000000000e-1                 
quadts: Estimated error = 10^   -501
Quadrature completed: CPU time =    1.047706
Result =
2.500000000000000000000000000000000000000000000000000000000000000000000000000000\
00000000000000000000000000000000000000000000000000000000000000000000000000000000\
00000000000000000000000000000000000000000000000000000000000000000000000000000000\
00000000000000000000000000000000000000000000000000000000000000000000000000000000\
00000000000000000000000000000000000000000000000000000000000000000000000000000000\
00000000000000000000000000000000000000000000000000000000000000000000000000000000\
00000000000000000000e-1                 
Actual error =  1.162753x10^  -507

Problem 2: Int_0^1 t^2*arctan(t) dt = (pi - 2 + 2*log(2))/12

quadts: Iteration  1 of 11; est error = 10^      0; approx value =
2.1047231245816686275584850222521521049853717692194154480287e-1                 
quadts: Iteration  2 of 11; est error = 10^      0; approx value =
2.1065725123782726843162819242030253082784853968816686163786e-1                 
quadts: Iteration  3 of 11; est error = 10^    -20; approx value =
2.1065725122580698782715176341961704656001932511977113740329e-1                 
quadts: Iteration  4 of 11; est error = 10^    -31; approx value =
2.1065725122580698810809230218298800170020449310180031641513e-1                 
quadts: Iteration  5 of 11; est error = 10^    -75; approx value =
2.1065725122580698810809230218298800169568080567463469410136e-1                 
quadts: Iteration  6 of 11; est error = 10^   -142; approx value =
2.1065725122580698810809230218298800169568080567463469410136e-1                 
quadts: Iteration  7 of 11; est error = 10^   -292; approx value =
2.1065725122580698810809230218298800169568080567463469410136e-1                 
quadts: Iteration  8 of 11; est error = 10^   -501; approx value =
2.1065725122580698810809230218298800169568080567463469410136e-1                 
quadts: Estimated error = 10^   -501
Quadrature completed: CPU time =    1.720179
Result =
2.106572512258069881080923021829880016956808056746346941013587176078836375187998\
69153313456611246203588845920712868639842872073756755570278815891742616552753442\
64493702989011595718114348922769182271905538829499763136764058990175094863757612\
30267225156831178723191228782719323009963684893269075127690628821131673508503274\
54852046517532375765869607038190162094468511701902588602939290388307810934884416\
66286616272002561161657917492537299867809144190316120653270808935658116378942179\
91655411190071260634e-1                 
Actual error = -5.579788x10^  -508

Problem 3: Int_0^(pi/2) e^t*cos(t) dt = 1/2*(e^(pi/2) - 1)

quadts: Iteration  1 of 11; est error = 10^      0; approx value =
1.9053094886982578305279092388581301413514027217312127901297e0                  
quadts: Iteration  2 of 11; est error = 10^      0; approx value =
1.9052386879976614825811733002838583061243242713892437589225e0                  
quadts: Iteration  3 of 11; est error = 10^    -18; approx value =
1.9052386904826758277372115620877151969777462393143738780181e0                  
quadts: Iteration  4 of 11; est error = 10^    -43; approx value =
1.9052386904826758277365178333519165631950854373319753346343e0                  
quadts: Iteration  5 of 11; est error = 10^    -98; approx value =
1.9052386904826758277365178333519165631950854373322674700104e0                  
quadts: Iteration  6 of 11; est error = 10^   -213; approx value =
1.9052386904826758277365178333519165631950854373322674700104e0                  
quadts: Iteration  7 of 11; est error = 10^   -450; approx value =
1.9052386904826758277365178333519165631950854373322674700104e0                  
quadts: Iteration  8 of 11; est error = 10^   -501; approx value =
1.9052386904826758277365178333519165631950854373322674700104e0                  
quadts: Estimated error = 10^   -501
Quadrature completed: CPU time =    0.716555
Result =
1.905238690482675827736517833351916563195085437332267470010407744621275952445791\
06837435238329194167732864111136784956463110167286032317199279277667595904469804\
85196040527787010036870516454041099334338500675891311536478648600647321738646130\
66840776692372852343695842613095336038432616941729086275792956664206353031364890\
08351710771589443964554673846706397865129826209106116060797421297345621394456639\
32853886913786390001148337350967162957032101980489156919946355336103910082031535\
65709751623335900933e0                  
Actual error = -7.963421x10^  -507

Problem 4: Int_0^1 arctan(sqrt(2+t^2))/((1+t^2)sqrt(2+t^2)) dt = 5*Pi^2/96

quadts: Iteration  1 of 11; est error = 10^      0; approx value =
5.1397487843142191233787336767333504266793881345872283695854e-1                 
quadts: Iteration  2 of 11; est error = 10^      0; approx value =
5.1404189362670924962704874731018457242391838561186016783228e-1                 
quadts: Iteration  3 of 11; est error = 10^    -17; approx value =
5.1404189589007076028810766873945583172020449748728384573069e-1                 
quadts: Iteration  4 of 11; est error = 10^    -35; approx value =
5.1404189589007076139762973957688287006746887898780610089696e-1                 
quadts: Iteration  5 of 11; est error = 10^    -71; approx value =
5.1404189589007076139762973957688287163092184412712451179236e-1                 
quadts: Iteration  6 of 11; est error = 10^   -145; approx value =
5.1404189589007076139762973957688287163092184412712451179236e-1                 
quadts: Iteration  7 of 11; est error = 10^   -288; approx value =
5.1404189589007076139762973957688287163092184412712451179236e-1                 
quadts: Iteration  8 of 11; est error = 10^   -501; approx value =
5.1404189589007076139762973957688287163092184412712451179236e-1                 
quadts: Estimated error = 10^   -501
Quadrature completed: CPU time =    2.148069
Result =
5.140418958900707613976297395768828716309218441271245117923619466781273345010002\
73073009031443674595407501349675730372087383976464689064933729719670728395711509\
91665917742581409226593964754376712400361212340323775727430059995023639246155101\
11364717844052965319018537525161363996494808893888891200186953578908385586348196\
14337310299626975139756184639916903455944011821548414945746574367611979498188911\
22252556561229545152420587390652527794021909738584709161295682590249423394515112\
21619827736683571373e-1                 
Actual error =  2.616669x10^  -507

Continuous functions on finite intervals, but non-diff at an endpoint:

Problem 5: Int_0^1 sqrt(t)*log(t) dt = -4/9

quadts: Iteration  1 of 11; est error = 10^      0; approx value =
-4.444392576516707717488134233627802823671186708727753169211e-1                 
quadts: Iteration  2 of 11; est error = 10^      0; approx value =
-4.444444444441117476326162579634883374927278854151820703559e-1                 
quadts: Iteration  3 of 11; est error = 10^    -24; approx value =
-4.444444444444444444444444444120514627410087635323248692822e-1                 
quadts: Iteration  4 of 11; est error = 10^    -56; approx value =
-4.444444444444444444444444444444444444444444444444444444444e-1                 
quadts: Iteration  5 of 11; est error = 10^   -123; approx value =
-4.444444444444444444444444444444444444444444444444444444444e-1                 
quadts: Iteration  6 of 11; est error = 10^   -258; approx value =
-4.444444444444444444444444444444444444444444444444444444444e-1                 
quadts: Iteration  7 of 11; est error = 10^   -501; approx value =
-4.444444444444444444444444444444444444444444444444444444444e-1                 
quadts: Estimated error = 10^   -501
Quadrature completed: CPU time =    0.743515
Result =
-4.44444444444444444444444444444444444444444444444444444444444444444444444444444\
44444444444444444444444444444444444444444444444444444444444444444444444444444444\
44444444444444444444444444444444444444444444444444444444444444444444444444444444\
44444444444444444444444444444444444444444444444444444444444444444444444444444444\
44444444444444444444444444444444444444444444444444444444444444444444444444444444\
44444444444444444444444444444444444444444444444444444444444444444444444444444444\
44444444444444444444e-1                 
Actual error = -2.454700x10^  -507

Problem 6: Int_0^1 sqrt(1-t^2) dt = pi/4

quadts: Iteration  1 of 11; est error = 10^      0; approx value =
7.8542738384415085579941868440919152543350756696087869878708e-1                 
quadts: Iteration  2 of 11; est error = 10^      0; approx value =
7.8539816339892810680793932178195796527751418989808815897237e-1                 
quadts: Iteration  3 of 11; est error = 10^    -23; approx value =
7.8539816339744830961566089120693041279766968651452626083551e-1                 
quadts: Iteration  4 of 11; est error = 10^    -50; approx value =
7.8539816339744830961566084581987572104929234984377006978132e-1                 
quadts: Iteration  5 of 11; est error = 10^    -99; approx value =
7.8539816339744830961566084581987572104929234984377645524374e-1                 
quadts: Iteration  6 of 11; est error = 10^   -195; approx value =
7.8539816339744830961566084581987572104929234984377645524374e-1                 
quadts: Iteration  7 of 11; est error = 10^   -389; approx value =
7.8539816339744830961566084581987572104929234984377645524374e-1                 
quadts: Iteration  8 of 11; est error = 10^   -501; approx value =
7.8539816339744830961566084581987572104929234984377645524374e-1                 
quadts: Estimated error = 10^   -501
Quadrature completed: CPU time =    0.042131
Result =
7.853981633974483096156608458198757210492923498437764552437361480769541015715522\
49657008706335529266995537021628320576661773461152387645557931339852032120279362\
57102567548463027638991115573723873259549110720274391648336153211891205844669579\
13178004772864121417308650871526135816620533484018150622853184311467516515788970\
43720380230240707313522928841091973147590002832632637205116630346036737985377902\
35826431759143989798827304652934548315294827627963701861559499068739183797143818\
12228069845457529873e-1                 
Actual error =  4.284977x10^  -507

Functions on finite intervals with integrable singularity at an endpoint:

Problem 7: Int_0^1 sqrt(t)/sqrt(1-t^2) dt = 2*sqrt(pi)*gamma(3/4)/gamma(1/4)

quadts: Iteration  1 of 11; est error = 10^      0; approx value =
1.1981388738927171596492218401463126985272569088474735376649e0                  
quadts: Iteration  2 of 11; est error = 10^      0; approx value =
1.1981402347347729557161185717273657693541021565714690610428e0                  
quadts: Iteration  3 of 11; est error = 10^    -24; approx value =
1.1981402347355922074399224889231403077101845048745397457260e0                  
quadts: Iteration  4 of 11; est error = 10^    -53; approx value =
1.1981402347355922074399224922803238782272126632159652603429e0                  
quadts: Iteration  5 of 11; est error = 10^    -89; approx value =
1.1981402347355922074399224922803238782272126632156515582637e0                  
quadts: Iteration  6 of 11; est error = 10^   -196; approx value =
1.1981402347355922074399224922803238782272126632156515582637e0                  
quadts: Iteration  7 of 11; est error = 10^   -385; approx value =
1.1981402347355922074399224922803238782272126632156515582637e0                  
quadts: Iteration  8 of 11; est error = 10^   -499; approx value =
1.1981402347355922074399224922803238782272126632156515582637e0                  
quadts: Estimated error = 10^   -499
Adjust nq1 and neps2 in initqts for greater accuracy.
Quadrature completed: CPU time =    0.084511
Result =
1.198140234735592207439922492280323878227212663215651558263674952946405214143915\
67083588555648979338937590722509724376227592887753970352803076560216976496727838\
70543041718873877355629063532093911521660691088669156563562802268663215657539261\
15289358757933417059753395500334751887440930772365593291188495599799130262083298\
37870957806158713627972864444622541447101174961729953748130528205821615488731173\
61130207945929664026967095913790275367046701929387031925359700645509616280707582\
56553767377440787478e0                  
Actual error =  2.917114x10^  -503

Problem 8: Int_0^1 log(t)^2 dt = 2

quadts: Iteration  1 of 11; est error = 10^      0; approx value =
2.0000107831445243001798182842597823153971961795338085941294e0                  
quadts: Iteration  2 of 11; est error = 10^      0; approx value =
2.0000000000004070641541545480633074341341566685317194072633e0                  
quadts: Iteration  3 of 11; est error = 10^    -25; approx value =
2.0000000000000000000000000000242212807278817632168117696002e0                  
quadts: Iteration  4 of 11; est error = 10^    -58; approx value =
2.0000000000000000000000000000000000000000000000000000000000e0                  
quadts: Iteration  5 of 11; est error = 10^   -125; approx value =
2.0000000000000000000000000000000000000000000000000000000000e0                  
quadts: Iteration  6 of 11; est error = 10^   -260; approx value =
2.0000000000000000000000000000000000000000000000000000000000e0                  
quadts: Iteration  7 of 11; est error = 10^   -500; approx value =
2.0000000000000000000000000000000000000000000000000000000000e0                  
quadts: Estimated error = 10^   -500
Quadrature completed: CPU time =    0.753468
Result =
2.000000000000000000000000000000000000000000000000000000000000000000000000000000\
00000000000000000000000000000000000000000000000000000000000000000000000000000000\
00000000000000000000000000000000000000000000000000000000000000000000000000000000\
00000000000000000000000000000000000000000000000000000000000000000000000000000000\
00000000000000000000000000000000000000000000000000000000000000000000000000000000\
00000000000000000000000000000000000000000000000000000000000000000000000000000000\
00000000000000000000e0                  
Actual error =  0.000000x10^     0

Problem 9: Int_0^(pi/2) log(cos(t)) dt = -pi*log(2)/2

quadts: Iteration  1 of 11; est error = 10^      0; approx value =
-1.088721155239041938600668717669823079820911175131966839371e0                  
quadts: Iteration  2 of 11; est error = 10^      0; approx value =
-1.088793045146372183847035105991429335526928098210811771082e0                  
quadts: Iteration  3 of 11; est error = 10^    -23; approx value =
-1.088793045151801065250343518968911954091052332343469765603e0                  
quadts: Iteration  4 of 11; est error = 10^    -48; approx value =
-1.088793045151801065250344449118806973669291850184630493300e0                  
quadts: Iteration  5 of 11; est error = 10^   -100; approx value =
-1.088793045151801065250344449118806973669291850184643147163e0                  
quadts: Iteration  6 of 11; est error = 10^   -190; approx value =
-1.088793045151801065250344449118806973669291850184643147163e0                  
quadts: Iteration  7 of 11; est error = 10^   -390; approx value =
-1.088793045151801065250344449118806973669291850184643147163e0                  
quadts: Iteration  8 of 11; est error = 10^   -501; approx value =
-1.088793045151801065250344449118806973669291850184643147163e0                  
quadts: Estimated error = 10^   -501
Quadrature completed: CPU time =    1.644238
Result =
-1.08879304515180106525034444911880697366929185018464314716289762659715427458837\
09932151644808053315125288070670466784663890382752183018855017480157396380332083\
54306398902900085594241828542310963591445370660726023127015955425916345915993755\
14471404728787235660813959863870243283917322582043549049800143118357720495768139\
37614300517748403040054689361489101255779158784515354862460462005166875618148048\
12741427347806442228493804186500811039648268762278370107101419646935945518379985\
78009519069847890533e0                  
Actual error =  4.112948x10^  -507

Problem 10: Int_0^(pi/2) sqrt(tan(t)) dt = pi*sqrt(2)/2

quadts: Iteration  1 of 11; est error = 10^      0; approx value =
2.2214419200261557866400112140841572981594994258103512321893e0                  
quadts: Iteration  2 of 11; est error = 10^      0; approx value =
2.2214414690779814033937678565841697512301697844374849058247e0                  
quadts: Iteration  3 of 11; est error = 10^    -22; approx value =
2.2214414690791831235079405542020634108934558367162668272157e0                  
quadts: Iteration  4 of 11; est error = 10^    -51; approx value =
2.2214414690791831235079404950303468493073108446884175917876e0                  
quadts: Iteration  5 of 11; est error = 10^    -92; approx value =
2.2214414690791831235079404950303468493073108446878451115427e0                  
quadts: Iteration  6 of 11; est error = 10^   -196; approx value =
2.2214414690791831235079404950303468493073108446878451115427e0                  
quadts: Iteration  7 of 11; est error = 10^   -385; approx value =
2.2214414690791831235079404950303468493073108446878451115427e0                  
quadts: Iteration  8 of 11; est error = 10^   -499; approx value =
2.2214414690791831235079404950303468493073108446878451115427e0                  
quadts: Estimated error = 10^   -499
Adjust nq1 and neps2 in initqts for greater accuracy.
Quadrature completed: CPU time =    0.321705
Result =
2.221441469079183123507940495030346849307310844687845111542697803478217396549736\
95528766346738238261868170510634261439568217979925917281374618767317983720751163\
96394098779387665567268305506532610638265097387212743605377051585542263547408014\
24891965537222550934667468518845625118383143448263922953616914676851398417066713\
06950662859997565759604664852856403861602683258051513782130360980447633853765055\
39449061973026800300633304880541561966581083978558128697007116872919787468362624\
26601161988821054866e0                  
Actual error =  1.837787x10^  -499

Functions on a semi-infinite interval:

Problem 11: Int_1^inf 1/(1+t^2) dt = pi/4

quades: Iteration  1 of 11; est error = 10^      0; approx value =
7.8539827569805444546415576158634397476401569047919401349033e-1                 
quades: Iteration  2 of 11; est error = 10^      0; approx value =
7.8539816339745384972790084890409694248325304758528278459935e-1                 
quades: Iteration  3 of 11; est error = 10^    -28; approx value =
7.8539816339744830961566084582393050581700347093964988476988e-1                 
quades: Iteration  4 of 11; est error = 10^    -59; approx value =
7.8539816339744830961566084581987572104929234984377645524374e-1                 
quades: Iteration  5 of 11; est error = 10^   -120; approx value =
7.8539816339744830961566084581987572104929234984377645524374e-1                 
quades: Iteration  6 of 11; est error = 10^   -239; approx value =
7.8539816339744830961566084581987572104929234984377645524374e-1                 
quades: Iteration  7 of 11; est error = 10^   -480; approx value =
7.8539816339744830961566084581987572104929234984377645524374e-1                 
quades: Iteration  8 of 11; est error = 10^   -501; approx value =
7.8539816339744830961566084581987572104929234984377645524374e-1                 
quades: Estimated error = 10^   -501
Quadrature completed: CPU time =    0.078901
Result =
7.853981633974483096156608458198757210492923498437764552437361480769541015715522\
49657008706335529266995537021628320576661773461152387645557931339852032120279362\
57102567548463027638991115573723873259549110720274391648336153211891205844669579\
13178004772864121417308650871526135816620533484018150622853184311467516515788970\
43720380230240707313522928841091973147590002832632637205116630346036737985377902\
35826431759143989798827304652934548315294827627963701861559499068739183797143818\
12228069845457529873e-1                 
Actual error = -1.964818x10^  -507

Problem 12: Int_0^inf e^(-t)/sqrt(t) dt = sqrt(pi)

quades: Iteration  1 of 11; est error = 10^      0; approx value =
1.7723240136871657073036534969920609866402992787057179445330e0                  
quades: Iteration  2 of 11; est error = 10^      0; approx value =
1.7724504867572758225694004525678592460019455748976126610548e0                  
quades: Iteration  3 of 11; est error = 10^     -8; approx value =
1.7724538509300517441919778527111126817943858155733755733432e0                  
quades: Iteration  4 of 11; est error = 10^    -21; approx value =
1.7724538509055160247108413317260731112767677726826166230229e0                  
quades: Iteration  5 of 11; est error = 10^    -29; approx value =
1.7724538509055160272981674833411283180965025686345814895290e0                  
quades: Iteration  6 of 11; est error = 10^    -57; approx value =
1.7724538509055160272981674833411451827975494561223871282179e0                  
quades: Iteration  7 of 11; est error = 10^   -100; approx value =
1.7724538509055160272981674833411451827975494561223871282138e0                  
quades: Iteration  8 of 11; est error = 10^   -184; approx value =
1.7724538509055160272981674833411451827975494561223871282138e0                  
quades: Iteration  9 of 11; est error = 10^   -338; approx value =
1.7724538509055160272981674833411451827975494561223871282138e0                  
quades: Iteration 10 of 11; est error = 10^   -496; approx value =
1.7724538509055160272981674833411451827975494561223871282138e0                  
quades: Estimated error = 10^   -496
Adjust nq1 and neps2 in initqes for greater accuracy.
Quadrature completed: CPU time =    1.391438
Result =
1.772453850905516027298167483341145182797549456122387128213807789852911284591032\
18137495065673854466541622682362428257066623615286572442260252509370960278706846\
20376986531051228499251730289508262289320953792679628001746390153514797205167001\
90185234018585446974494912640313921775525906216405419332500906398407613733477475\
15343366798978936585183640879545116516173876005906739343179133280985484624818490\
20546548521956132515616474675150427387610561079961271072100603720444836723652966\
13708094323498831668e0                  
Actual error =  2.983494x10^  -499

Problem 13: Int_0^inf e^(-t^2/2) dt = sqrt(pi/2)

quades: Iteration  1 of 11; est error = 10^      0; approx value =
1.2488199508118878906916386133293672947554024521955702569868e0                  
quades: Iteration  2 of 11; est error = 10^      0; approx value =
1.2534548402553050621256240679306746462602618358951200416769e0                  
quades: Iteration  3 of 11; est error = 10^     -6; approx value =
1.2533140691864946138093791103515473281332180957634341470343e0                  
quades: Iteration  4 of 11; est error = 10^    -13; approx value =
1.2533141373154766549419716744116325837146051174841788210509e0                  
quades: Iteration  5 of 11; est error = 10^    -26; approx value =
1.2533141373155002512078827591591929603849288233009234601535e0                  
quades: Iteration  6 of 11; est error = 10^    -46; approx value =
1.2533141373155002512078826424055226265034933702078554860415e0                  
quades: Iteration  7 of 11; est error = 10^    -85; approx value =
1.2533141373155002512078826424055226265034933703049691583150e0                  
quades: Iteration  8 of 11; est error = 10^   -161; approx value =
1.2533141373155002512078826424055226265034933703049691583150e0                  
quades: Iteration  9 of 11; est error = 10^   -287; approx value =
1.2533141373155002512078826424055226265034933703049691583150e0                  
quades: Iteration 10 of 11; est error = 10^   -501; approx value =
1.2533141373155002512078826424055226265034933703049691583150e0                  
quades: Estimated error = 10^   -501
Quadrature completed: CPU time =    1.060846
Result =
1.253314137315500251207882642405522626503493370304969158314961788171146827303920\
98747329791918902863305800498633260193982243316180906336809047892782798307396595\
67177402290618655686639021565099694013235751172327524492129011647069313898343418\
06516837911922090578039245047800020687575137645825730612921930932460349530463332\
04559400786984862618885126937412392431674432129875329475654786938171362596344020\
10142859296248681540498922626927504998205096491293227940685848173374007644872616\
52367917373878099480e0                  
Actual error =  5.345501x10^  -507

Problem 14: Int_pi^inf e^(-t)*cos(t) dt = -1/2 * exp(-pi)

quades: Iteration  1 of 11; est error = 10^      0; approx value =
-2.152051727455376533786655985702702049786408193630650081023e-2                 
quades: Iteration  2 of 11; est error = 10^      0; approx value =
-2.157395354401372651806594284380531218528940581436059888069e-2                 
quades: Iteration  3 of 11; est error = 10^     -3; approx value =
-2.160660813593271204057439423500714366536974118968474577650e-2                 
quades: Iteration  4 of 11; est error = 10^     -8; approx value =
-2.160695914218951050948678651472186004461444836057143770337e-2                 
quades: Iteration  5 of 11; est error = 10^    -18; approx value =
-2.160695913188612350459941224888750242550156125678985274464e-2                 
quades: Iteration  6 of 11; est error = 10^    -28; approx value =
-2.160695913188612488720886858590677214289176718598831343765e-2                 
quades: Iteration  7 of 11; est error = 10^    -54; approx value =
-2.160695913188612488720886858586400563786405490531654165261e-2                 
quades: Iteration  8 of 11; est error = 10^    -95; approx value =
-2.160695913188612488720886858586400563786405490531654149036e-2                 
quades: Iteration  9 of 11; est error = 10^   -179; approx value =
-2.160695913188612488720886858586400563786405490531654149036e-2                 
quades: Iteration 10 of 11; est error = 10^   -321; approx value =
-2.160695913188612488720886858586400563786405490531654149036e-2                 
quades: Iteration 11 of 11; est error = 10^   -502; approx value =
-2.160695913188612488720886858586400563786405490531654149036e-2                 
quades: Estimated error = 10^   -502
Quadrature completed: CPU time =    5.856907
Result =
-2.16069591318861248872088685858640056378640549053165414903598437005253828785089\
83849069979980950542193508403482298831028163259915889829332132729473524382710871\
52669469841450890542397134702937180108504897946523347525665408430353437511779164\
88124513804367420908619398983484206375759797876657167657542945026145860208679730\
69473909549974234421262092342407666389719928869148913196258215432547762045516867\
72928507493879837468967058482620110356198800310992116841028662548790554000710970\
05809493992972479008e-2                 
Actual error = -8.813231x10^  -507

Functions on the entire real line:

Problem 15: Int_-inf^inf 1/(1+t^2) dt = Pi

quadss: Iteration  1 of 11; est error = 10^      0; approx value =
3.1415926733057047917682293723553835657845378873982352113118e0                  
quadss: Iteration  2 of 11; est error = 10^      0; approx value =
3.1415926535897941561586068574043989200075636967822728959867e0                  
quadss: Iteration  3 of 11; est error = 10^    -29; approx value =
3.1415926535897932384626433832794978215996974224550778096576e0                  
quadss: Iteration  4 of 11; est error = 10^    -66; approx value =
3.1415926535897932384626433832795028841971693993751058209749e0                  
quadss: Iteration  5 of 11; est error = 10^   -135; approx value =
3.1415926535897932384626433832795028841971693993751058209749e0                  
quadss: Iteration  6 of 11; est error = 10^   -271; approx value =
3.1415926535897932384626433832795028841971693993751058209749e0                  
quadss: Iteration  7 of 11; est error = 10^   -501; approx value =
3.1415926535897932384626433832795028841971693993751058209749e0                  
quadss: Estimated error = 10^   -501
Quadrature completed: CPU time =    0.020763
Result =
3.141592653589793238462643383279502884197169399375105820974944592307816406286208\
99862803482534211706798214808651328230664709384460955058223172535940812848111745\
02841027019385211055596446229489549303819644288109756659334461284756482337867831\
65271201909145648566923460348610454326648213393607260249141273724587006606315588\
17488152092096282925409171536436789259036001133053054882046652138414695194151160\
94330572703657595919530921861173819326117931051185480744623799627495673518857527\
24891227938183011949e0                  
Actual error =  3.477565x10^  -507

Problem 16: Int_-inf^inf 1/(1+t^4) dt = Pi/Sqrt(2)

quadss: Iteration  1 of 11; est error = 10^      0; approx value =
2.2873333120708424181659658321277583409453891709639420447705e0                  
quadss: Iteration  2 of 11; est error = 10^      0; approx value =
2.2223779474318677162257884231874197551369747988939592627415e0                  
quadss: Iteration  3 of 11; est error = 10^     -7; approx value =
2.2214416533512096240126970094943366413837064916521987664414e0                  
quadss: Iteration  4 of 11; est error = 10^    -14; approx value =
2.2214414690791875303101920335040445377959114880965591234615e0                  
quadss: Iteration  5 of 11; est error = 10^    -29; approx value =
2.2214414690791831235079404949872463397043406097856796679830e0                  
quadss: Iteration  6 of 11; est error = 10^    -56; approx value =
2.2214414690791831235079404950303468493073108446878451115410e0                  
quadss: Iteration  7 of 11; est error = 10^   -114; approx value =
2.2214414690791831235079404950303468493073108446878451115427e0                  
quadss: Iteration  8 of 11; est error = 10^   -230; approx value =
2.2214414690791831235079404950303468493073108446878451115427e0                  
quadss: Iteration  9 of 11; est error = 10^   -460; approx value =
2.2214414690791831235079404950303468493073108446878451115427e0                  
quadss: Iteration 10 of 11; est error = 10^   -501; approx value =
2.2214414690791831235079404950303468493073108446878451115427e0                  
quadss: Estimated error = 10^   -501
Quadrature completed: CPU time =    0.152920
Result =
2.221441469079183123507940495030346849307310844687845111542697803478217396549736\
95528766346738238261868170510634261439568217979925917281374618767317983720751163\
96394098779387665567268305506532610638265097387212743605377051585542263547408014\
24891965537222550934667468518845625118383143448263922953616914676851398417066713\
06950662859997565759604664852856403861602683258051513782130360980447633853765055\
39449061973026800300633304880541561966581083978558128697007116872919787468362624\
26601161988821054866e0                  
Actual error = -1.212352x10^  -506

Problem 17: Int_-inf^inf e^(-t^2/2) dt = sqrt (2*Pi)

quadss: Iteration  1 of 11; est error = 10^      0; approx value =
2.4331546222011867004504480442017753715757339426589972494156e0                  
quadss: Iteration  2 of 11; est error = 10^      0; approx value =
2.5051762881370988070820974615837301259818296850634043695448e0                  
quadss: Iteration  3 of 11; est error = 10^     -6; approx value =
2.5066278827210647770483659359155324974892088177330827353545e0                  
quadss: Iteration  4 of 11; est error = 10^    -14; approx value =
2.5066282746152020706285326615725743511256244860347343597136e0                  
quadss: Iteration  5 of 11; est error = 10^    -18; approx value =
2.5066282746310005024142446276773550691462547943715965765798e0                  
quadss: Iteration  6 of 11; est error = 10^    -40; approx value =
2.5066282746310005024157652848110452530091407998682086537572e0                  
quadss: Iteration  7 of 11; est error = 10^    -72; approx value =
2.5066282746310005024157652848110452530069867406099383166299e0                  
quadss: Iteration  8 of 11; est error = 10^   -135; approx value =
2.5066282746310005024157652848110452530069867406099383166299e0                  
quadss: Iteration  9 of 11; est error = 10^   -252; approx value =
2.5066282746310005024157652848110452530069867406099383166299e0                  
quadss: Iteration 10 of 11; est error = 10^   -473; approx value =
2.5066282746310005024157652848110452530069867406099383166299e0                  
quadss: Iteration 11 of 11; est error = 10^   -501; approx value =
2.5066282746310005024157652848110452530069867406099383166299e0                  
quadss: Estimated error = 10^   -501
Quadrature completed: CPU time =    1.128723
Result =
2.506628274631000502415765284811045253006986740609938316629923576342293654607841\
97494659583837805726611600997266520387964486632361812673618095785565596614793191\
34354804581237311373278043130199388026471502344655048984258023294138627796686836\
13033675823844181156078490095600041375150275291651461225843861864920699060926664\
09118801573969725237770253874824784863348864259750658951309573876342725192688040\
20285718592497363080997845253855009996410192982586455881371696346748015289745233\
04735834747756198961e0                  
Actual error = -7.913038x10^  -507

Problem 18: Int_-inf^inf e^(-t^2/2) cos(t) dt = sqrt (2*Pi/e)

quadss: Iteration  1 of 11; est error = 10^      0; approx value =
1.6851747890514937181691020182521702469188055519757616633807e0                  
quadss: Iteration  2 of 11; est error = 10^      0; approx value =
1.5280975093060326563899873021123513023967968415786779074332e0                  
quadss: Iteration  3 of 11; est error = 10^     -5; approx value =
1.5203540536404671537183297092548958844043266758567985664815e0                  
quadss: Iteration  4 of 11; est error = 10^    -11; approx value =
1.5203469009141177914844996551173456254744956876656256311428e0                  
quadss: Iteration  5 of 11; est error = 10^    -19; approx value =
1.5203469010662808054793802345810608478089326283156934364867e0                  
quadss: Iteration  6 of 11; est error = 10^    -36; approx value =
1.5203469010662808056119401467549756276750631783352669304107e0                  
quadss: Iteration  7 of 11; est error = 10^    -69; approx value =
1.5203469010662808056119401467549756270361074187790463375284e0                  
quadss: Iteration  8 of 11; est error = 10^   -129; approx value =
1.5203469010662808056119401467549756270361074187790463375284e0                  
quadss: Iteration  9 of 11; est error = 10^   -247; approx value =
1.5203469010662808056119401467549756270361074187790463375284e0                  
quadss: Iteration 10 of 11; est error = 10^   -464; approx value =
1.5203469010662808056119401467549756270361074187790463375284e0                  
quadss: Iteration 11 of 11; est error = 10^   -501; approx value =
1.5203469010662808056119401467549756270361074187790463375284e0                  
quadss: Estimated error = 10^   -501
Quadrature completed: CPU time =    2.084816
Result =
1.520346901066280805611940146754975627036107418779046337528363868526734623930058\
30431484153725956557707165875842731929211729710779498534245448506883721537038918\
58483285864658533042953908643790399861771529710308588164212837921008215336137362\
49045220683362597548842849341065362064236118394717894428348580598159422641535202\
97912755500106511285307831076157641170961857333862524375310424084058074174767050\
46753591154644337395843578238824830758865926607331531649786341233901868498806842\
56994412284365267293e0                  
Actual error = -5.400448x10^  -507
Total CPU time =   36.697099
