<svg width="115" height="88" viewBox="0 0 115 88" fill="none" xmlns="http://www.w3.org/2000/svg">
<path d="M115 54.0279C115 48.9799 112.165 44.614 107.981 42.5674C109.736 38.7473 110.681 34.5178 110.681 30.0155C110.681 13.507 97.4531 0 80.9859 0C69.6479 0 59.7946 6.4124 54.8005 15.8264C51.2911 11.8698 46.162 9.55039 40.493 9.55039C29.2899 9.55039 20.2465 18.6915 20.2465 30.0155C20.2465 32.6078 20.7864 35.0636 21.5962 37.3829C19.9765 36.8372 18.0869 36.4279 16.3322 36.4279C7.28873 36.2915 0 43.6589 0 52.8C0 61.9411 7.28873 69.3085 16.3322 69.3085C18.8967 69.3085 21.3263 68.6264 23.4859 67.5349C26.4554 73.1287 32.9343 76.9488 40.493 76.9488C45.892 76.9488 50.6162 75.0388 53.9906 71.9008C57.77 81.3147 66.9484 88 77.6115 88C90.1643 88 100.423 78.9954 102.717 66.9892C109.601 66.5798 115 60.9861 115 54.0279Z" fill="white"/>
</svg>
