<svg width="16" height="17" viewBox="0 0 16 17" fill="none" xmlns="http://www.w3.org/2000/svg">
<path d="M11.5341 0.353516H4.39449C1.96751 0.353516 0 2.38797 0 4.89755V12.2801C0 14.7896 1.96751 16.8241 4.39449 16.8241H11.5341C13.9611 16.8241 15.9286 14.7896 15.9286 12.2801V4.89755C15.9286 2.38797 13.9611 0.353516 11.5341 0.353516ZM14.5148 12.2801C14.5148 13.9856 13.1717 15.3622 11.5341 15.3622H4.39449C2.74509 15.3622 1.41378 13.9734 1.41378 12.2801V4.89755C1.41378 3.20419 2.75687 1.8154 4.39449 1.8154H11.5341C13.1835 1.8154 14.5148 3.20419 14.5148 4.89755V12.2801Z" fill="#838383"/>
<path d="M7.96428 4.34912C5.70223 4.34912 3.85254 6.24957 3.85254 8.58859C3.85254 10.9276 5.69045 12.8402 7.96428 12.8402C10.2263 12.8402 12.076 10.9398 12.076 8.58859C12.076 6.24957 10.2263 4.34912 7.96428 4.34912ZM7.96428 11.3784C6.47981 11.3784 5.26632 10.1358 5.26632 8.60077C5.2781 7.05361 6.47981 5.81101 7.96428 5.81101C9.44874 5.81101 10.6622 7.05361 10.6622 8.58859C10.6622 10.1236 9.44874 11.3784 7.96428 11.3784Z" fill="#838383"/>
<path d="M12.2409 3.10547C11.9699 3.10547 11.6989 3.21511 11.5104 3.42221C11.3219 3.61713 11.2041 3.89732 11.2041 4.17752C11.2041 4.45771 11.3101 4.73791 11.5104 4.93283C11.6989 5.12774 11.9699 5.24957 12.2409 5.24957C12.5118 5.24957 12.7828 5.13993 12.9713 4.93283C13.1598 4.73791 13.2776 4.45771 13.2776 4.17752C13.2776 3.89732 13.1716 3.61713 12.9713 3.42221C12.7828 3.21511 12.5236 3.10547 12.2409 3.10547Z" fill="#838383"/>
</svg>
