<svg width="36" height="30" viewBox="0 0 36 30" fill="none" xmlns="http://www.w3.org/2000/svg">
<path d="M13.464 0.119995L14.024 0.903992C9.69332 3.74132 7.52799 7.13866 7.52799 11.096C7.52799 15.352 10.1787 19.16 15.48 22.52L9.65599 29.688C6.74399 28.568 4.42932 26.888 2.71199 24.648C0.994653 22.3333 0.135986 19.72 0.135986 16.808C0.135986 13.5227 1.36799 10.424 3.83199 7.51199C6.29599 4.52533 9.50665 2.06133 13.464 0.119995ZM33.624 0.119995L34.184 0.903992C29.8533 3.74132 27.688 7.13866 27.688 11.096C27.688 15.352 30.3387 19.16 35.64 22.52L29.816 29.688C26.904 28.568 24.5893 26.888 22.872 24.648C21.1547 22.3333 20.296 19.72 20.296 16.808C20.296 13.5227 21.528 10.424 23.992 7.51199C26.456 4.52533 29.6667 2.06133 33.624 0.119995Z" fill="#9C9C9C"/>
</svg>
