<svg width="44" height="26" viewBox="0 0 44 26" fill="none" xmlns="http://www.w3.org/2000/svg">
<path d="M0 13L41 13" stroke="black" stroke-width="2"/>
<path d="M30 1L42 13L30 25" stroke="black" stroke-width="2"/>
</svg>
