<svg width="422" height="40" viewBox="0 0 422 40" fill="none" xmlns="http://www.w3.org/2000/svg">
<g clip-path="url(#clip0)">
<path d="M36.7075 35.0086V22.1734H24.2018V23.243H30.0702H31.2843V24.4315V34.5332V35.0482L30.9201 35.4047C30.2321 36.0385 29.3417 36.6328 28.2895 37.1081C27.3991 37.5439 26.3468 37.9004 25.0922 38.2173C23.7567 38.4946 22.2592 38.6531 20.519 38.6531C18.4144 38.6531 16.4718 38.2966 14.6911 37.6231C12.8699 36.9497 11.2915 35.8405 9.99642 34.4143C8.7418 32.9882 7.73002 31.2056 7.04201 29.0268C6.354 26.9272 5.98975 24.3522 5.98975 21.4604C5.98975 18.6081 6.31352 16.1124 7.00154 14.0525C7.68955 11.9529 8.66086 10.1702 9.91547 8.74411C11.1701 7.31799 12.708 6.24839 14.4078 5.57495C16.1076 4.9015 17.9693 4.54497 19.9928 4.54497C22.583 4.54497 25.1327 4.98073 27.5205 5.85225C29.5845 6.60492 31.5676 7.79336 33.4698 9.33833L34.6434 7.99143C32.8222 6.64454 30.7177 5.4561 28.3704 4.58458C25.5779 3.5546 22.583 3 19.4667 3C16.4718 3 13.7602 3.39615 11.332 4.22805C8.94416 5.02034 6.92059 6.20878 5.26127 7.75375C3.60195 9.29871 2.30686 11.2398 1.4165 13.4979C0.485656 15.7559 0 18.4893 0 21.5C0 24.5107 0.485656 27.2441 1.37602 29.5418C2.26639 31.7998 3.60195 33.7409 5.30174 35.2859C7.00154 36.8308 9.10605 38.0193 11.5343 38.8116C14.0031 39.6039 16.8361 40.0396 19.9524 40.0396C22.7044 40.0396 25.1732 39.7623 27.2777 39.2077C29.4226 38.6531 31.2439 38.0589 32.7008 37.3854C34.1983 36.6724 35.5338 35.8801 36.7075 35.0086Z" fill="black"/>
<path d="M75.4376 36.3558C77.8254 34.7316 78.9586 32.5528 78.9586 29.7401C78.9586 27.6406 78.311 25.9767 77.0159 24.6298C75.6399 23.2829 73.7378 22.3322 71.269 21.8568L66.6553 20.9457L71.1476 19.5592C73.0902 18.965 74.5067 18.0538 75.4376 16.8654C76.3684 15.677 76.8136 14.3301 76.8136 12.7059C76.8136 11.4382 76.5303 10.329 75.9637 9.2594C75.3971 8.22942 74.5472 7.31828 73.3735 6.56561C72.1594 5.77331 70.581 5.13948 68.6788 4.70372C66.7362 4.26796 64.3889 4.03027 61.7178 4.03027H44.4365V38.8911H63.3366C68.8812 38.9307 72.9688 38.0592 75.4376 36.3558ZM50.5072 6.2883H61.7178C64.4698 6.2883 66.5743 6.84291 67.9908 7.9125C69.4478 9.02171 70.2168 10.6459 70.2168 12.7059C70.2168 15.875 68.7598 19.678 61.7178 19.678H50.5072V6.2883ZM49.9002 21.8964H63.3366C66.3315 21.8964 68.6788 22.5303 70.3382 23.7583C72.0784 25.0656 73.0093 27.0859 73.0093 29.7401C73.0093 32.2755 72.1189 34.177 70.3382 35.4842C68.6788 36.7123 66.3315 37.3065 63.3771 37.3065H49.9406V21.8964H49.9002Z" fill="black"/>
</g>
<path d="M100.602 5C103.802 5 105.802 5.7 105.802 5.7V6.99999C105.802 6.99999 103.602 6.4 101.002 6.4C96.602 6.4 93.802 8.39999 93.802 11.5C93.802 14.8 96.702 16.6 100.702 16.6C102.602 16.6 104.102 16.1 105.002 15.7V10.3H106.502V16.4C106.502 16.4 104.402 18 100.602 18C95.302 18 92.002 15.6 92.002 11.5C91.902 7.59999 95.602 5 100.602 5Z" fill="black"/>
<path d="M111.102 5.30078H121.302V6.60078H112.902V10.6008H119.802V11.8008H112.902V16.5008H121.902V17.8008H111.102V5.30078Z" fill="black"/>
<path d="M132.402 5C136.902 5 140.602 7.59999 140.602 11.5C140.602 15.4 136.902 18 132.402 18C127.902 18 124.202 15.5 124.202 11.5C124.202 7.59999 127.902 5 132.402 5ZM132.402 16.6C135.802 16.6 138.802 14.6 138.802 11.5C138.802 8.39999 135.902 6.4 132.402 6.4C129.002 6.4 126.102 8.39999 126.102 11.5C126.002 14.7 128.902 16.6 132.402 16.6Z" fill="black"/>
<path d="M144.602 5.3C144.602 5.3 146.402 5 148.902 5C152.902 5 154.902 6.69999 154.902 8.99999C154.902 10.9 153.302 12 151.502 12.6L157.002 17.7H154.702L149.702 13C148.202 13.3 146.802 13.3 146.202 13.3V17.7H144.502V5.3H144.602ZM146.802 12.1C148.602 12.1 153.102 11.9 153.102 9.1C153.102 7.5 151.702 6.3 148.902 6.3C148.002 6.3 147.002 6.4 146.302 6.4V12H146.802V12.1Z" fill="black"/>
<path d="M167.502 5C170.702 5 172.702 5.7 172.702 5.7V6.99999C172.702 6.99999 170.502 6.4 167.902 6.4C163.502 6.4 160.702 8.39999 160.702 11.5C160.702 14.8 163.602 16.6 167.602 16.6C169.502 16.6 171.002 16.1 171.902 15.7V10.3H173.402V16.4C173.402 16.4 171.302 18 167.502 18C162.202 18 158.902 15.6 158.902 11.5C158.802 7.59999 162.502 5 167.502 5Z" fill="black"/>
<path d="M178.002 5.30078H188.202V6.60078H179.802V10.6008H186.702V11.8008H179.802V16.5008H188.902V17.8008H178.002V5.30078Z" fill="black"/>
<path d="M191.702 15.1006C191.702 15.1006 193.802 16.7006 197.402 16.7006C200.002 16.7006 201.302 15.6006 201.302 14.5006C201.302 11.9006 191.802 12.8006 191.802 8.60059C191.802 6.50059 193.902 5.10059 198.202 5.10059C200.302 5.10059 202.002 5.60059 202.002 5.60059L201.902 8.50058H200.702V6.70059C200.002 6.50059 199.102 6.40059 198.002 6.40059C195.002 6.40059 193.502 7.10059 193.502 8.60059C193.502 11.5006 203.002 10.5006 203.002 14.6006C203.002 16.7006 201.202 18.2006 197.302 18.2006C193.102 18.2006 191.102 16.6006 191.102 16.6006L191.702 15.1006Z" fill="black"/>
<path d="M213.802 5.3C213.802 5.3 216.202 5 218.502 5C222.302 5 223.602 6.4 223.602 8.4C223.602 9.9 222.502 10.7 221.702 11.2C223.302 11.6 225.002 12.5 225.002 14.3C225.002 16.8 222.302 18.1 218.902 18.1C216.102 18.1 213.702 17.8 213.702 17.8V5.3H213.802ZM220.002 10.9C220.102 10.9 220.202 10.9 220.402 10.9C221.102 10.5 222.102 9.8 222.102 8.6C222.102 7.2 221.202 6.2 218.602 6.2C217.602 6.2 216.402 6.3 215.502 6.4V10.9C215.602 11 217.102 10.9 220.002 10.9ZM219.002 16.8C221.602 16.8 223.402 16 223.402 14.2C223.402 12.7 221.402 11.9 219.902 11.9C217.102 11.9 215.602 11.9 215.402 11.9V16.5C216.502 16.6 217.902 16.8 219.002 16.8Z" fill="black"/>
<path d="M229.202 5.30078H239.402V6.60078H231.002V10.6008H237.902V11.8008H231.002V16.5008H240.102V17.8008H229.302V5.30078H229.202Z" fill="black"/>
<path d="M243.802 5.3C243.802 5.3 245.602 5 248.102 5C252.102 5 254.102 6.69999 254.102 8.99999C254.102 10.9 252.502 12 250.702 12.6L256.202 17.7H253.902L248.902 13C247.402 13.3 246.002 13.3 245.402 13.3V17.7H243.702V5.3H243.802ZM246.002 12.1C247.802 12.1 252.302 11.9 252.302 9.1C252.302 7.5 250.902 6.3 248.102 6.3C247.202 6.3 246.202 6.4 245.502 6.4V12H246.002V12.1Z" fill="black"/>
<path d="M266.702 5C269.902 5 271.902 5.7 271.902 5.7V6.99999C271.902 6.99999 269.702 6.4 267.102 6.4C262.702 6.4 259.902 8.39999 259.902 11.5C259.902 14.8 262.802 16.6 266.802 16.6C268.702 16.6 270.202 16.1 271.102 15.7V10.3H272.602V16.4C272.602 16.4 270.502 18 266.702 18C261.402 18 258.102 15.6 258.102 11.5C258.002 7.59999 261.702 5 266.702 5Z" fill="black"/>
<path d="M277.102 5.30078H287.302V6.60078H278.902V10.6008H285.802V11.8008H278.902V16.5008H288.002V17.8008H277.202V5.30078H277.102Z" fill="black"/>
<path d="M290.902 15.1006C290.902 15.1006 293.002 16.7006 296.602 16.7006C299.202 16.7006 300.502 15.6006 300.502 14.5006C300.502 11.9006 291.002 12.8006 291.002 8.60059C291.002 6.50059 293.102 5.10059 297.402 5.10059C299.502 5.10059 301.202 5.60059 301.202 5.60059L301.102 8.50058H299.902V6.70059C299.202 6.50059 298.302 6.40059 297.202 6.40059C294.202 6.40059 292.702 7.10059 292.702 8.60059C292.702 11.5006 302.202 10.5006 302.202 14.6006C302.202 16.7006 300.402 18.2006 296.502 18.2006C292.302 18.2006 290.302 16.6006 290.302 16.6006L290.902 15.1006Z" fill="black"/>
<path d="M320.102 4.90039C323.702 4.90039 326.002 5.70039 326.002 5.70039V8.40039C326.002 8.40039 323.102 7.80038 320.802 7.80038C316.902 7.80038 315.002 9.40039 315.002 11.6004C315.002 14.2004 317.402 15.3004 320.402 15.3004C321.602 15.3004 322.702 15.1004 323.602 14.8004V10.4004H326.802V16.4004C326.802 16.4004 324.302 18.2004 320.302 18.2004C314.502 18.2004 311.302 15.5004 311.302 11.6004C311.202 7.70039 314.902 4.90039 320.102 4.90039Z" fill="black"/>
<path d="M334.902 5.30078H339.502L345.702 17.7008H341.802L340.602 15.3008H333.402L332.302 17.7008H328.502L334.902 5.30078ZM339.502 13.0008C338.502 11.0008 337.402 8.70078 337.002 7.80078C336.602 8.60078 335.502 11.0008 334.502 13.0008H339.502Z" fill="black"/>
<path d="M348.202 5.30078H352.002V15.2008H359.702V17.8008H348.202V5.30078Z" fill="black"/>
<path d="M362.002 5.30078H365.802V15.2008H373.502V17.8008H362.002V5.30078Z" fill="black"/>
<path d="M375.802 5.30078H387.202V8.00078H379.502V10.0008H385.702V12.6008H379.502V15.1008H387.602V17.8008H375.702V5.30078H375.802Z" fill="black"/>
<path d="M390.602 5.30038C390.602 5.30038 393.102 4.90039 396.102 4.90039C400.602 4.90039 402.902 6.70039 402.902 9.10039C402.902 11.0004 401.502 12.1004 399.802 12.9004L404.802 17.8004H400.102L396.302 13.8004C395.502 13.9004 394.802 14.0004 394.202 14.0004V17.9004H390.702V5.30038H390.602ZM399.102 9.40039C399.102 8.40039 398.102 7.70039 396.202 7.70039C395.602 7.70039 394.902 7.70038 394.202 7.80038V11.4004C395.902 11.4004 399.102 11.2004 399.102 9.40039Z" fill="black"/>
<path d="M408.902 5.30078C410.902 8.30078 412.602 10.8008 413.402 11.8008L417.702 5.30078H421.502L413.002 17.7008H409.202L411.302 14.4008L404.802 5.30078H408.902V5.30078Z" fill="black"/>
<path d="M282.002 3.1H283.002L281.802 0H280.002L282.002 3.1Z" fill="black"/>
<path d="M92 29.4004H93.1L100.9 37.0004C100.9 37.0004 100.9 36.9004 100.9 36.8004V29.4004H102V38.5004H100.9L93.2 31.0004C93.2 31.0004 93.2 31.1004 93.2 31.3004V38.5004H92V29.4004Z" fill="black"/>
<path d="M108.9 31.2002C111.1 31.2002 112.7 32.3002 112.7 34.3002C112.7 34.8002 112.5 35.1002 112.5 35.1002H106C106 35.2002 106 35.3002 106 35.4002C106 37.0002 107.5 37.8002 109.3 37.8002C111.3 37.8002 112.4 36.9002 112.4 36.9002L112.7 37.6002C112.7 37.6002 111.5 38.6002 109.1 38.6002C106.8 38.6002 104.7 37.4002 104.7 35.2002C104.7 32.9002 106.5 31.2002 108.9 31.2002ZM111.6 34.5002C111.6 34.5002 111.6 34.5002 111.6 34.3002C111.6 32.7002 110.4 32.1002 108.9 32.1002C107.3 32.1002 106.1 33.2002 106 34.6002H111.6V34.5002Z" fill="black"/>
<path d="M115.3 31.5L117.9 37.3C118.7 35.6 120 32.5 120.3 31.5H121.6C121.9 32.4 123.8 36.7 124 37.3C124.9 35.8 126.3 32.4 126.6 31.5H127.9C127.4 32.9 125.7 36.7 124.4 38.5H123.1C123.1 38.7 121.2 33.8 120.8 32.9C120.4 33.9 119.2 37 118.4 38.5H117.1L113.9 31.5H115.3Z" fill="black"/>
<path d="M135 29.4004L139.3 35.3004L143.2 29.4004H144.5L138.4 38.5004H137.1L138.6 36.2004L133.6 29.4004H135V29.4004Z" fill="black"/>
<path d="M149.1 31.2002C151.8 31.2002 153.8 32.7002 153.8 34.9002C153.8 37.1002 151.8 38.6002 149.1 38.6002C146.4 38.6002 144.4 37.1002 144.4 34.9002C144.4 32.7002 146.4 31.2002 149.1 31.2002ZM149.1 37.7002C151 37.7002 152.5 36.6002 152.5 34.9002C152.5 33.2002 151 32.1002 149.1 32.1002C147.2 32.1002 145.8 33.2002 145.8 34.9002C145.7 36.6002 147.1 37.7002 149.1 37.7002Z" fill="black"/>
<path d="M156.2 31.4998H157.3V34.0998C157.8 32.7998 158.5 31.2998 160.2 31.2998C160.9 31.2998 161.2 31.4998 161.2 31.4998V32.4998C161.2 32.4998 160.7 32.3998 160.3 32.3998H160.1C158.4 32.3998 157.9 33.9998 157.5 35.3998V38.3998H156.2V31.4998Z" fill="black"/>
<path d="M163.2 28H164.5V34.8L165.5 34L169.2 31.5H170.7L166.6 34.5L171.1 38.5H169.6L165.7 35.1L164.6 35.9V38.5H163.3V28H163.2Z" fill="black"/>
<path d="M197.9 29.4002C197.9 29.4002 199.7 29.2002 201.4 29.2002C204.2 29.2002 205.1 30.2002 205.1 31.7002C205.1 32.8002 204.3 33.4002 203.7 33.7002C204.8 34.0002 206.2 34.7002 206.2 35.9002C206.2 37.7002 204.3 38.7002 201.8 38.7002C199.7 38.7002 198 38.5002 198 38.5002V29.4002H197.9ZM202.4 33.5002C202.5 33.5002 202.6 33.5002 202.7 33.5002C203.2 33.2002 204 32.7002 204 31.8002C204 30.8002 203.4 30.0002 201.4 30.0002C200.7 30.0002 199.8 30.1002 199.1 30.1002V33.4002C199.2 33.5002 200.3 33.5002 202.4 33.5002ZM201.7 37.7002C203.6 37.7002 204.9 37.1002 204.9 35.8002C204.9 34.7002 203.5 34.1002 202.4 34.1002C200.4 34.1002 199.2 34.1002 199.1 34.1002V37.4002C199.8 37.7002 200.8 37.7002 201.7 37.7002Z" fill="black"/>
<path d="M212.1 31.2002C214.3 31.2002 215.9 32.3002 215.9 34.3002C215.9 34.8002 215.7 35.1002 215.7 35.1002H209.2C209.2 35.2002 209.2 35.3002 209.2 35.4002C209.2 37.0002 210.7 37.8002 212.5 37.8002C214.5 37.8002 215.6 36.9002 215.6 36.9002L215.9 37.6002C215.9 37.6002 214.7 38.6002 212.3 38.6002C210 38.6002 207.9 37.4002 207.9 35.2002C207.9 32.9002 209.7 31.2002 212.1 31.2002ZM214.8 34.5002C214.8 34.5002 214.8 34.5002 214.8 34.3002C214.8 32.7002 213.6 32.1002 212.1 32.1002C210.5 32.1002 209.3 33.2002 209.2 34.6002H214.8V34.5002Z" fill="black"/>
<path d="M218.5 31.4998H219.6V34.0998C220.1 32.7998 220.8 31.2998 222.5 31.2998C223.2 31.2998 223.5 31.4998 223.5 31.4998V32.4998C223.5 32.4998 223 32.3998 222.6 32.3998H222.4C220.7 32.3998 220.2 33.9998 219.8 35.3998V38.3998H218.5V31.4998Z" fill="black"/>
<path d="M225.4 28H226.7V38.5H225.4V28Z" fill="black"/>
<path d="M230.6 28.5996C231.1 28.5996 231.4 28.9996 231.4 29.2996C231.4 29.5996 231.1 29.9996 230.6 29.9996C230.1 29.9996 229.9 29.5996 229.9 29.2996C229.9 28.9996 230.2 28.5996 230.6 28.5996ZM230 31.4996H231.3V38.4996H230V31.4996Z" fill="black"/>
<path d="M234.7 31.4998H235.9V33.2998C236.1 32.9998 237.3 31.2998 239.4 31.2998C241.2 31.2998 242.3 32.2998 242.3 34.1998V38.4998H241V34.1998C241 32.7998 240.1 32.2998 238.9 32.2998C237 32.2998 235.8 34.1998 235.8 34.2998V38.5998H234.5V31.4998H234.7Z" fill="black"/>
<path d="M183.5 34.6004C183.832 34.6004 184.1 34.3318 184.1 34.0004C184.1 33.669 183.832 33.4004 183.5 33.4004C183.169 33.4004 182.9 33.669 182.9 34.0004C182.9 34.3318 183.169 34.6004 183.5 34.6004Z" fill="black"/>
<defs>
<clipPath id="clip0">
<rect width="79" height="37" fill="white" transform="translate(0 3)"/>
</clipPath>
</defs>
</svg>
