<svg width="1510" height="116" viewBox="0 0 1510 116" fill="none" xmlns="http://www.w3.org/2000/svg">
<path d="M530.377 51.5474C334.5 -33.8983 110.516 36.152 0 51.5474V83.382C249.212 40.588 366.5 12.0544 530.377 83.382C641 131.531 844.59 125.314 992.5 69.6014C1178.5 -0.458565 1396.48 52.3302 1512 70.8569V45.8068C1247.16 1.96906 1146.5 -30.3985 977.616 45.8068C895.981 65.986 675.851 115.006 530.377 51.5474Z" fill="#311858"/>
</svg>
