<svg width="1070" height="541" viewBox="0 0 1070 541" fill="none" xmlns="http://www.w3.org/2000/svg">
<path fill-rule="evenodd" clip-rule="evenodd" d="M0 1.05065V0H1070V541H0V537.949C29.7867 454.013 46 363.65 46 269.5C46 175.35 29.7867 84.9872 0 1.05065Z" fill="#D9D9D9"/>
</svg>
