<svg width="600" height="607" viewBox="0 0 600 607" fill="none" xmlns="http://www.w3.org/2000/svg">
<path d="M296.426 0.00483184C271.689 0.11818 248.064 2.22862 227.273 5.90975C166.026 16.7264 154.908 39.3746 154.908 81.1354V136.293H299.632V154.677H100.597C58.5343 154.677 21.7068 179.959 10.1884 228.051C-3.10037 283.177 -3.68871 317.575 10.1884 375.135C20.4761 417.98 45.0404 448.509 87.1035 448.509H136.864V382.389C136.864 334.621 178.193 292.482 227.273 292.482H371.819C412.063 292.482 444.184 259.352 444.184 218.94V81.1408C444.184 41.9168 411.097 12.4516 371.824 5.90975C346.963 1.76983 321.168 -0.108517 296.426 0.00483184V0.00483184ZM218.161 44.3673C233.113 44.3673 245.317 56.7709 245.317 72.0298C245.317 87.2293 233.113 99.5195 218.167 99.5195C203.162 99.5195 191.006 87.2293 191.006 72.0298C191.006 56.7709 203.162 44.3673 218.161 44.3673V44.3673Z" fill="url(#paint0_linear_389_442)"/>
<path d="M462.233 154.677V218.94C462.233 268.765 419.992 310.698 371.824 310.698H227.273C187.676 310.698 154.908 344.589 154.908 384.24V522.05C154.908 561.269 189.015 584.338 227.273 595.592C273.082 609.059 317.012 611.493 371.819 595.592C408.258 585.04 444.184 563.811 444.184 522.05V466.893H299.632V448.508H516.544C558.607 448.508 574.281 419.167 588.909 375.134C604.016 329.8 603.374 286.204 588.909 228.051C578.513 186.182 558.661 154.677 516.544 154.677H462.233ZM380.93 503.661C395.935 503.661 408.091 515.956 408.091 531.156C408.091 546.415 395.935 558.818 380.93 558.818C365.979 558.818 353.781 546.415 353.781 531.156C353.781 515.956 365.979 503.661 380.93 503.661Z" fill="url(#paint1_linear_389_442)"/>
<defs>
<linearGradient id="paint0_linear_389_442" x1="281.358" y1="118.222" x2="515.31" y2="493.399" gradientUnits="userSpaceOnUse">
<stop stop-color="white"/>
<stop offset="0.78125" stop-color="#306998"/>
</linearGradient>
<linearGradient id="paint1_linear_389_442" x1="600" y1="770.058" x2="255.541" y2="360.787" gradientUnits="userSpaceOnUse">
<stop stop-color="#FFD43B"/>
<stop offset="1" stop-color="white"/>
</linearGradient>
</defs>
</svg>
