<svg width="915" height="539" viewBox="0 0 915 539" fill="none" xmlns="http://www.w3.org/2000/svg">
<path d="M227.916 152.423H222.916V157.423V385.297V390.297H227.916H379.624H383.082H388.082H389.48H406.117H408.658L410.156 388.243L483.851 287.197L557.236 388.235L558.734 390.297H561.282H578.238H588.051L582.283 382.358L499.269 268.101L579.317 152.722V157.423V169.551V174.551H584.317H659.619V385.297V390.297H664.619H678.696H683.696V385.297V174.551H759.318H764.318V169.551V157.423V152.423H759.318H584.317H579.524L662.392 32.979L654.359 27.0302L553.839 154.324L553.788 154.389L553.739 154.455L483.903 249.152L415.61 154.497L414.113 152.423H411.555H395.239H386.482H385.46H381.482H227.916ZM469.039 268.148L388.082 378.742V373.169V368.169H383.082H246.993V277.956H373.164H378.164V272.956V260.828V255.828H373.164H246.993V174.551H381.482H386.482V169.551V157.423V153.838L391.186 160.35L469.039 268.148Z" fill="white" stroke="white" stroke-width="10"/>
<path d="M35.7991 152.423H30.7991V157.423V385.297V390.297H35.7991H49.8759H54.8608L54.8759 385.312L55.4672 190.645L191.647 388.135L191.708 388.223L191.772 388.308L292.043 521.204L300.184 515.403L57.5441 154.632L56.058 152.423H53.3951H35.7991Z" fill="white" stroke="white" stroke-width="10"/>
<path d="M764.212 372.111H763.712V372.611C763.712 380.116 766.459 386.352 771.236 390.707C776.007 395.059 782.765 397.5 790.732 397.5C799.209 397.5 806.07 394.985 810.812 390.23C815.553 385.474 818.115 378.538 818.115 369.816V309.082V308.582H817.615H804.114H803.614V309.082V369.756C803.614 374.465 802.413 377.999 800.228 380.354C798.049 382.702 794.822 383.949 790.612 383.949C786.857 383.949 783.743 382.792 781.552 380.813C779.363 378.838 778.059 376.012 777.972 372.599L777.959 372.111H777.472H764.212ZM835.276 371.338H834.743L834.777 371.869C835.268 379.688 838.821 386.113 844.708 390.573C850.586 395.026 858.762 397.5 868.487 397.5C878.872 397.5 887.371 394.908 893.286 390.193C899.212 385.468 902.5 378.644 902.5 370.291C902.5 363.731 900.626 358.579 896.44 354.554C892.275 350.551 885.874 347.714 876.92 345.654C876.919 345.654 876.918 345.654 876.917 345.654L867.339 343.335L867.334 343.334C861.686 342.029 857.794 340.517 855.32 338.614C852.882 336.738 851.809 334.475 851.809 331.567C851.809 327.874 853.499 324.823 856.49 322.679C859.494 320.526 863.828 319.278 869.09 319.278C879.058 319.278 885.765 324.114 886.98 331.706L887.047 332.127H887.474H900.614H901.141L901.113 331.599C900.311 316.8 887.109 306.5 869.271 306.5C859.692 306.5 851.662 309.066 846.015 313.607C840.359 318.156 837.126 324.665 837.126 332.459C837.126 338.867 838.953 344.027 842.819 348.042C846.672 352.042 852.503 354.855 860.417 356.68C860.417 356.681 860.418 356.681 860.418 356.681L871.626 359.357L871.629 359.357C877.362 360.691 881.419 362.321 884.037 364.386C886.625 366.428 887.818 368.902 887.818 372.017C887.818 375.63 885.935 378.775 882.697 381.035C879.453 383.299 874.857 384.663 869.512 384.663C857.988 384.663 850.246 379.554 849.152 371.769L849.091 371.338H848.657H835.276ZM739.86 396.429C745.265 396.429 749.221 392.334 749.221 387.066C749.221 381.798 745.265 377.703 739.86 377.703C734.519 377.703 730.5 381.796 730.5 387.066C730.5 392.336 734.519 396.429 739.86 396.429Z" fill="white" stroke="white"/>
</svg>
