<svg width="1019" height="645" viewBox="0 0 1019 645" fill="none" xmlns="http://www.w3.org/2000/svg">
<path d="M229.628 586.423H230.655L230.628 585.397C228.906 519.462 223.304 446.749 213.823 367.263L213.718 366.381H212.83H169.552H168.829L168.602 367.067L116.424 524.893L64.5659 367.069L64.3399 366.381H63.6159H18.3846H17.5034L17.3925 367.255C8.77774 435.132 3.38785 507.84 1.24306 585.395L1.21464 586.423H2.24268H35.5067H36.49L36.5066 585.44C37.5492 523.46 40.018 466.99 43.9194 416.034L97.8525 585.726L98.0741 586.423H98.8056H126.591H127.321L127.543 585.727L181.903 415.714C187.462 468.803 190.875 525.367 192.134 585.444L192.155 586.423H193.134H229.628ZM388.88 424.733L388.896 424.643V424.552V424.538V423.538H387.896H353.334H352.453L352.342 424.413C346.381 471.62 336.123 515.398 321.563 555.712C321.416 552.423 320.943 548.61 320.154 544.284C318.798 536.856 316.498 527.849 313.262 517.27L313.261 517.267L284.517 424.25L284.299 423.545H283.562H247.709H246.337L246.757 424.852L286.806 549.222C289.813 558.574 292.065 566.323 293.565 572.48C295.07 578.658 295.799 583.165 295.799 586.063C295.799 594.55 292.088 602.272 284.512 609.219C278.259 614.837 270.025 617.688 259.655 617.688C253.883 617.688 248.876 617.34 244.622 616.725L243.479 616.56V617.715V637.159V637.83L244.1 638.084C252.973 641.717 260.551 643.585 266.764 643.585C289.857 643.585 310.89 629.187 329.933 600.903L329.936 600.899C354.381 564.151 374.014 505.402 388.88 424.733Z" fill="white" stroke="white" stroke-width="2"/>
<path d="M873.67 586.423H874.67V585.423V558.582V557.582H873.67H805.879V367.381V366.381H804.879H770.011H769.011V367.381V585.423V586.423H770.011H873.67ZM743.736 591.189L744.274 590.264L743.314 589.79L704.612 570.695C707.772 568.023 710.801 565.121 713.569 561.813C730.82 541.555 739.341 511.678 739.341 472.357C739.341 436.186 732.248 408.869 717.894 390.579C703.504 372.244 681.943 363.138 653.397 363.138C625.385 363.138 603.42 372.383 587.706 390.959C570.47 411.237 561.948 440.999 561.948 480.117C561.948 518.536 569.492 546.942 584.787 565.038L584.79 565.042C598.82 581.487 619.922 589.639 647.911 589.639C658.195 589.639 667.666 588.398 676.329 585.889L728.137 616.054L729.003 616.558L729.505 615.692L743.736 591.189ZM613.874 541.264L613.138 541.722L613.874 541.264C605.197 527.304 600.781 504.734 600.781 473.338C600.781 445.957 604.946 425.58 613.149 412.079C621.302 398.658 633.487 391.956 649.85 391.956C667.01 391.956 679.455 398.392 687.429 411.174C696.091 425.156 700.527 447.524 700.527 478.479C700.527 506.088 696.359 526.628 688.155 540.235C679.999 553.761 667.816 560.509 651.465 560.509H651.465C634.297 560.517 621.853 554.101 613.874 541.264ZM528.07 571.28L528.072 571.279C541.849 559.199 548.751 543.753 548.751 524.985C548.751 514.251 546.6 505.566 542.252 498.022C537.911 490.49 531.421 484.166 522.858 478.09L522.818 478.061L522.775 478.037L522.672 478.217C522.775 478.036 522.774 478.036 522.774 478.036L522.773 478.036L522.769 478.033L522.752 478.024L522.684 477.985L522.419 477.834L521.398 477.253C520.511 476.748 519.226 476.018 517.637 475.116C514.457 473.311 510.057 470.818 505.173 468.061C495.408 462.55 483.701 455.985 475.95 451.778C459.038 442.382 450.221 431.433 450.221 419.093C450.221 410.992 453.79 404.375 459.665 399.158L459.67 399.154C465.426 393.98 473.784 391.328 484.812 391.328C498.464 391.328 512.322 394.307 526.387 400.283L527.29 400.666L527.691 399.772L536.097 381.041L536.448 380.259L535.728 379.793C518.991 368.953 500.403 363.476 479.975 363.476C460.183 363.476 443.946 368.965 431.34 380.049C418.73 391.108 412.439 405.657 412.439 423.593C412.439 434.406 414.541 443.16 418.783 450.755C423.02 458.341 429.354 464.701 437.708 470.789L437.752 470.821L437.799 470.849L438.297 469.981C437.799 470.849 437.799 470.849 437.799 470.849L437.8 470.849L437.805 470.852L437.821 470.861L437.887 470.899L438.146 471.048L439.143 471.619C440.008 472.115 441.262 472.833 442.815 473.721C445.919 475.497 450.218 477.953 454.994 480.67C464.544 486.104 476.01 492.591 483.658 496.792C500.11 506 508.748 516.81 508.748 529.216C508.748 539.17 504.469 547.016 497.258 552.64C490.042 558.236 480.018 561.115 467.019 561.115C453.223 561.115 437.786 556.892 420.657 548.312L419.762 547.864L419.315 548.758L409.942 567.477L409.549 568.261L410.275 568.753C430.431 582.405 451.3 589.29 472.852 589.29C495.826 589.29 514.276 583.311 528.07 571.28Z" fill="white" stroke="white" stroke-width="2"/>
<path d="M917.455 294.351C896.364 293.815 880.043 295.937 866.342 301.734C865.345 302.132 864.2 302.43 863.036 302.732C859.58 303.631 855.955 304.573 855.54 308.314C856.763 309.521 857.368 311.151 858.006 312.871C858.487 314.164 858.986 315.509 859.781 316.762C862.937 322.03 868.449 329.117 873.474 332.813C879.002 337.044 884.539 341.233 890.35 344.921C895.396 348.043 900.775 350.522 906.127 352.989C911.644 355.531 917.132 358.061 922.198 361.267C925.525 363.368 928.84 365.82 932.158 368.276C934.644 370.115 937.132 371.956 939.628 373.651C940.683 374.429 941.599 375.386 942.521 376.35C944.097 377.998 945.694 379.666 948.041 380.499V379.694C947.065 378.457 946.454 376.931 945.834 375.38C945.266 373.96 944.69 372.52 943.817 371.26L935.909 363.63C928.264 353.362 918.768 344.399 908.522 337.037C906.33 335.527 903.463 333.877 900.36 332.091C891.515 327 880.75 320.803 878.218 313.61L877.68 313.074C883.102 312.565 889.472 310.692 894.785 309.13C895.149 309.023 895.508 308.918 895.861 308.814C900.36 307.628 904.662 307.172 908.994 306.714C913.288 306.259 917.612 305.802 922.19 304.626C925.924 303.692 929.632 302.55 933.372 301.398C933.87 301.245 934.368 301.091 934.868 300.938V298.561C932.674 296.378 930.771 293.866 928.868 291.352C926.632 288.401 924.396 285.448 921.686 283.025C908.275 271.439 893.489 260.106 878.218 250.621C873.253 247.417 867.428 244.905 861.669 242.422C857.936 240.812 854.231 239.214 850.805 237.448C849.749 236.914 848.449 236.471 847.12 236.018C844.497 235.125 841.756 234.191 840.533 232.441C837.122 228.257 834.786 223.118 832.46 218.002C831.564 216.03 830.669 214.061 829.715 212.152C822.105 197.675 814.708 181.61 808.13 166.301C806.387 162.533 804.893 158.768 803.416 155.041C800.865 148.61 798.36 142.293 794.693 136.279C767.545 91.4994 738.06 64.3773 692.74 37.756C683.884 32.7137 673.497 30.3033 662.374 27.7222C661.27 27.4659 660.158 27.2079 659.04 26.9455L639.273 25.9012C636.77 24.8052 634.265 22.5939 631.873 20.4819C630.233 19.0347 628.647 17.6342 627.15 16.6708C612.116 7.19304 573.407 -13.3495 562.349 13.7718C556.432 28.0147 567.619 42.058 575.052 51.3888C576.565 53.289 577.923 54.9938 578.95 56.465C579.87 57.7062 580.847 58.9825 581.845 60.2866C585.701 65.3255 589.875 70.7794 592.362 76.2252C593.312 78.5168 593.912 80.8806 594.52 83.2769C595.101 85.5625 595.688 87.8777 596.594 90.188C597.601 92.958 598.593 95.8023 599.595 98.675C602.786 107.826 606.077 117.264 610.296 125.497C613.187 131.012 616.34 136.808 620.035 141.802C620.741 142.777 621.622 143.57 622.512 144.372C624.288 145.97 626.1 147.601 626.636 150.772C624.237 154.197 623.281 158.761 622.319 163.35C621.808 165.79 621.296 168.238 620.564 170.525C611.086 200.291 614.788 237.166 628.222 259.041C632.425 265.628 642.453 280.127 655.866 274.57C664.364 271.179 665.434 262.527 666.606 253.055C667.072 249.29 667.554 245.396 668.524 241.651C668.806 240.508 668.919 239.506 669.023 238.594C669.207 236.97 669.359 235.633 670.37 234.296V234.811C671.371 236.818 672.376 238.806 673.376 240.786C676.046 246.071 678.686 251.295 681.162 256.672C689.335 269.57 703.566 283.011 715.417 291.946C717.722 293.687 719.853 295.879 722.013 298.103C725.77 301.969 729.618 305.929 734.638 307.777V306.988H734.118C733.059 305.428 731.679 304.436 730.257 303.415C729.526 302.89 728.784 302.357 728.069 301.734C723.317 296.988 718.061 291.191 714.367 285.93C703.327 271.171 693.55 254.831 684.882 237.97C680.998 230.493 677.607 222.38 674.44 214.804C674.142 214.091 673.846 213.383 673.552 212.681C672.966 211.524 672.596 210.152 672.231 208.799C671.601 206.467 670.987 204.194 669.314 203.19C667.937 205.202 666.341 207.12 664.723 209.065C661.685 212.716 658.571 216.459 656.684 221.087C652.728 230.039 651.568 240.614 650.341 251.806C650.012 254.801 649.679 257.839 649.286 260.903L648.25 261.411C640.618 259.493 637.512 252.141 634.615 245.281C634.326 244.598 634.04 243.919 633.751 243.252C625.86 224.536 624.534 194.494 631.382 172.901C631.734 171.84 632.311 170.342 632.992 168.575C635.853 161.146 640.54 148.978 637.982 144.728C636.986 141.562 634.535 139.252 632.134 136.989C630.711 135.648 629.305 134.323 628.229 132.845C624.83 127.853 621.106 121.534 618.737 115.991C615.776 109.082 613.505 101.823 611.227 94.5434C608.642 86.2855 606.049 78.0003 602.433 70.1668C599.835 64.5572 595.675 58.787 591.802 53.4137C590.933 52.2084 590.078 51.0231 589.259 49.8641C587.564 47.4648 585.812 45.3048 584.082 43.1718C580.687 38.9861 577.377 34.9043 574.747 29.3216C573.435 26.4234 571.595 21.6849 573.703 18.5325C574.218 16.4166 575.29 15.6266 577.391 15.0976C580.804 12.2139 590.557 15.8808 593.977 17.4677C603.744 21.4161 611.911 25.1044 620.063 30.6337C621.264 31.4951 622.494 32.6073 623.77 33.7611C626.411 36.1488 629.249 38.7146 632.439 39.6039H637.982C641.844 40.4456 645.932 40.6215 649.991 40.7961C654.774 41.0019 659.516 41.2059 663.799 42.4953C677.758 46.9804 690.402 53.56 701.74 60.6609C736.242 82.5437 764.695 113.636 783.909 150.772C785.694 154.194 786.898 157.454 788.128 160.782C789.072 163.338 790.031 165.935 791.28 168.677C794.159 175.383 797.394 182.159 800.61 188.893C803.588 195.131 806.55 201.333 809.197 207.414C809.715 208.573 810.231 209.734 810.748 210.895C815.744 222.136 820.747 233.39 827.915 242.709C830.687 246.598 839.343 249.185 846.707 251.386C849.813 252.314 852.69 253.174 854.798 254.034C856.855 254.959 859.359 255.843 861.929 256.752C865.926 258.164 870.084 259.633 872.971 261.397C881.929 266.919 890.861 273.258 899.291 279.33C900.352 280.131 901.992 281.152 903.861 282.315C909.368 285.744 916.869 290.413 917.455 294.351ZM648.729 65.4138C645.092 65.3763 641.466 65.8225 637.947 66.7397V67.2686H638.454C639.751 69.841 641.633 71.9315 643.5 74.0066C644.689 75.3279 645.872 76.643 646.896 78.0723C648.042 80.3541 649.107 82.6257 650.171 84.8971C651.077 86.8304 651.983 88.7635 652.939 90.7025L653.447 90.1804C657.163 87.5501 659.011 83.3329 659.011 77.0075C658.124 75.9755 657.652 74.9563 657.181 73.9381C656.803 73.1198 656.425 72.3021 655.831 71.479C654.889 69.8778 653.259 68.7654 651.647 67.6651C650.603 66.9527 649.566 66.2454 648.729 65.4138Z" fill="white"/>
<path d="M917.455 294.351C896.364 293.815 880.043 295.937 866.342 301.734C865.345 302.132 864.2 302.43 863.036 302.732C859.58 303.631 855.955 304.573 855.54 308.314C856.763 309.521 857.368 311.151 858.006 312.871C858.487 314.164 858.986 315.509 859.781 316.762C862.937 322.03 868.449 329.117 873.474 332.813C879.002 337.044 884.539 341.233 890.35 344.921C895.396 348.043 900.775 350.522 906.127 352.989C911.644 355.531 917.132 358.061 922.198 361.267C925.525 363.368 928.84 365.82 932.158 368.276C934.644 370.115 937.132 371.956 939.628 373.651C940.683 374.429 941.599 375.386 942.521 376.35C944.097 377.998 945.694 379.666 948.041 380.499V379.694C947.065 378.457 946.454 376.931 945.834 375.38C945.266 373.96 944.69 372.52 943.817 371.26L935.909 363.63C928.264 353.362 918.768 344.399 908.522 337.037C906.33 335.527 903.463 333.877 900.36 332.091C891.515 327 880.75 320.803 878.218 313.61L877.68 313.074C883.102 312.565 889.472 310.692 894.785 309.13C895.149 309.023 895.508 308.918 895.861 308.814C900.36 307.628 904.662 307.172 908.994 306.714C913.288 306.259 917.612 305.802 922.19 304.626C925.924 303.692 929.632 302.55 933.372 301.398C933.87 301.245 934.368 301.091 934.868 300.938V298.561C932.674 296.378 930.771 293.866 928.868 291.352C926.632 288.401 924.396 285.448 921.686 283.025C908.275 271.439 893.489 260.106 878.218 250.621C873.253 247.417 867.428 244.905 861.669 242.422C857.936 240.812 854.231 239.214 850.805 237.448C849.749 236.914 848.449 236.471 847.12 236.018C844.497 235.125 841.756 234.191 840.533 232.441C837.122 228.257 834.786 223.118 832.46 218.002C831.564 216.03 830.669 214.061 829.715 212.152C822.105 197.675 814.708 181.61 808.13 166.301C806.387 162.533 804.893 158.768 803.416 155.041C800.865 148.61 798.36 142.293 794.693 136.279C767.545 91.4994 738.06 64.3773 692.74 37.756C683.884 32.7137 673.497 30.3033 662.374 27.7222C661.27 27.4659 660.158 27.2079 659.04 26.9455L639.273 25.9012C636.77 24.8052 634.265 22.5939 631.873 20.4819C630.233 19.0347 628.647 17.6342 627.15 16.6708C612.116 7.19304 573.407 -13.3495 562.349 13.7718C556.432 28.0147 567.619 42.058 575.052 51.3888C576.565 53.289 577.923 54.9938 578.95 56.465C579.87 57.7062 580.847 58.9825 581.845 60.2866C585.701 65.3255 589.875 70.7794 592.362 76.2252C593.312 78.5168 593.912 80.8806 594.52 83.2769C595.101 85.5625 595.688 87.8777 596.594 90.188C597.601 92.958 598.593 95.8023 599.595 98.675C602.786 107.826 606.077 117.264 610.296 125.497C613.187 131.012 616.34 136.808 620.035 141.802C620.741 142.777 621.622 143.57 622.512 144.372C624.288 145.97 626.1 147.601 626.636 150.772C624.237 154.197 623.281 158.761 622.319 163.35C621.808 165.79 621.296 168.238 620.564 170.525C611.086 200.291 614.788 237.166 628.222 259.041C632.425 265.628 642.453 280.127 655.866 274.57C664.364 271.179 665.434 262.527 666.606 253.055C667.072 249.29 667.554 245.396 668.524 241.651C668.806 240.508 668.919 239.506 669.023 238.594C669.207 236.97 669.359 235.633 670.37 234.296V234.811C671.371 236.818 672.376 238.806 673.376 240.786C676.046 246.071 678.686 251.295 681.162 256.672C689.335 269.57 703.566 283.011 715.417 291.946C717.722 293.687 719.853 295.879 722.013 298.103C725.77 301.969 729.618 305.929 734.638 307.777V306.988H734.118C733.059 305.428 731.679 304.436 730.257 303.415C729.526 302.89 728.784 302.357 728.069 301.734C723.317 296.988 718.061 291.191 714.367 285.93C703.327 271.171 693.55 254.831 684.882 237.97C680.998 230.493 677.607 222.38 674.44 214.804C674.142 214.091 673.846 213.383 673.552 212.681C672.966 211.524 672.596 210.152 672.231 208.799C671.601 206.467 670.987 204.194 669.314 203.19C667.937 205.202 666.341 207.12 664.723 209.065C661.685 212.716 658.571 216.459 656.684 221.087C652.728 230.039 651.568 240.614 650.341 251.806C650.012 254.801 649.679 257.839 649.286 260.903L648.25 261.411C640.618 259.493 637.512 252.141 634.615 245.281C634.326 244.598 634.04 243.919 633.751 243.252C625.86 224.536 624.534 194.494 631.382 172.901C631.734 171.84 632.311 170.342 632.992 168.575C635.853 161.146 640.54 148.978 637.982 144.728C636.986 141.562 634.535 139.252 632.134 136.989C630.711 135.648 629.305 134.323 628.229 132.845C624.83 127.853 621.106 121.534 618.737 115.991C615.776 109.082 613.505 101.823 611.227 94.5434C608.642 86.2855 606.049 78.0003 602.433 70.1668C599.835 64.5572 595.675 58.787 591.802 53.4137C590.933 52.2084 590.078 51.0231 589.259 49.8641C587.564 47.4648 585.812 45.3048 584.082 43.1718C580.687 38.9861 577.377 34.9043 574.747 29.3216C573.435 26.4234 571.595 21.6849 573.703 18.5325C574.218 16.4166 575.29 15.6266 577.391 15.0976C580.804 12.2139 590.557 15.8808 593.977 17.4677C603.744 21.4161 611.911 25.1044 620.063 30.6337C621.264 31.4951 622.494 32.6073 623.77 33.7611C626.411 36.1488 629.249 38.7146 632.439 39.6039H637.982C641.844 40.4456 645.932 40.6215 649.991 40.7961C654.774 41.0019 659.516 41.2059 663.799 42.4953C677.758 46.9804 690.402 53.56 701.74 60.6609C736.242 82.5437 764.695 113.636 783.909 150.772C785.694 154.194 786.898 157.454 788.128 160.782C789.072 163.338 790.031 165.935 791.28 168.677C794.159 175.383 797.394 182.159 800.61 188.893C803.588 195.131 806.55 201.333 809.197 207.414C809.715 208.573 810.231 209.734 810.748 210.895C815.744 222.136 820.747 233.39 827.915 242.709C830.687 246.598 839.343 249.185 846.707 251.386C849.813 252.314 852.69 253.174 854.798 254.034C856.855 254.959 859.359 255.843 861.929 256.752C865.926 258.164 870.084 259.633 872.971 261.397C881.929 266.919 890.861 273.258 899.291 279.33C900.352 280.131 901.992 281.152 903.861 282.315C909.368 285.744 916.869 290.413 917.455 294.351ZM648.729 65.4138C645.092 65.3763 641.466 65.8225 637.947 66.7397V67.2686H638.454C639.751 69.841 641.633 71.9315 643.5 74.0066C644.689 75.3279 645.872 76.643 646.896 78.0723C648.042 80.3541 649.107 82.6257 650.171 84.8971C651.077 86.8304 651.983 88.7635 652.939 90.7025L653.447 90.1804C657.163 87.5501 659.011 83.3329 659.011 77.0075C658.124 75.9755 657.652 74.9563 657.181 73.9381C656.803 73.1198 656.425 72.3021 655.831 71.479C654.889 69.8778 653.259 68.7654 651.647 67.6651C650.603 66.9527 649.566 66.2454 648.729 65.4138Z" stroke="white"/>
<path d="M1004.57 584V585H1005.57H1017H1018V584V528.018V527.018H1017H999.85H999.151L998.911 527.674L985.823 563.407L971.605 527.648L971.354 527.018H970.676H954.168H953.168V528.018V584V585H954.168H964.959H965.959V584V545.317L980.548 584.35L980.79 585H981.484H989.702H990.397L990.639 584.349L1004.57 546.959V584ZM912.49 584.001L912.49 585H913.49H925.584H926.584V584V538.494H941.413H942.413V537.494V528V527H941.413H897H896V528V537.494V538.494H897H912.455L912.49 584.001Z" fill="white" stroke="white" stroke-width="2"/>
</svg>
