<svg width="1071" height="541" viewBox="0 0 1071 541" fill="none" xmlns="http://www.w3.org/2000/svg">
<path fill-rule="evenodd" clip-rule="evenodd" d="M1070 538.964C1040.21 455.023 1024 364.655 1024 270.5C1024 176.345 1040.21 85.9769 1070 2.03643V0H0.00484419V541H1070V538.964Z" fill="#D9D9D9"/>
</svg>
