<svg width="907" height="282" viewBox="0 0 907 282" fill="none" xmlns="http://www.w3.org/2000/svg">
<path fill-rule="evenodd" clip-rule="evenodd" d="M80.5711 0V201.35C80.5711 245.634 44.2911 281.908 0 281.908V241.583C22.4678 241.583 40.3316 223.722 40.3316 201.258V0H80.5711ZM816.116 40.3252H907V0.0920722H685.453V40.3252H775.784V282H816.116V40.3252ZM563.997 0V201.35C563.997 223.814 546.134 241.675 523.666 241.675C501.198 241.675 483.334 223.814 483.334 201.35V80.5582C483.334 36.2742 447.054 0 402.763 0C358.472 0 322.192 36.2742 322.192 80.5582V201.442C322.192 223.906 304.328 241.767 281.861 241.767C259.393 241.767 241.529 223.906 241.529 201.442V0H201.197V201.35C201.197 245.634 237.477 281.908 281.768 281.908C326.06 281.908 362.34 245.634 362.34 201.35V80.5582C362.34 58.094 380.203 40.2331 402.671 40.2331C425.139 40.2331 443.003 58.094 443.003 80.5582V201.442C443.003 245.726 479.283 282 523.574 282C567.865 282 604.145 245.726 604.145 201.442V0H563.997Z" fill="white"/>
</svg>
