<svg width="652" height="546" viewBox="0 0 652 546" fill="none" xmlns="http://www.w3.org/2000/svg">
<path d="M549.987 259.087H522.782V231.897H495.582V259.087H468.377V286.276H495.582V313.468H522.782V286.276H549.987V259.087Z" fill="white"/>
<path d="M652 259.087H624.795V231.897H597.595V259.087H570.39V286.276H597.595V313.468H624.795V286.276H652V259.087Z" fill="white"/>
<path d="M272.838 545.359C122.395 545.359 0 423.035 0 272.679C0 122.323 122.395 0 272.838 0C369.915 0 460.451 52.2101 509.113 136.254L391.036 204.542C366.681 162.474 321.387 136.34 272.838 136.34C197.615 136.34 136.419 197.5 136.419 272.679C136.419 347.856 197.615 409.019 272.838 409.019C321.392 409.019 366.686 382.885 391.044 340.809L509.121 409.094C460.459 493.146 369.92 545.359 272.838 545.359Z" fill="white"/>
</svg>
