{
	"id": "70aae9e1-1c69-4cb1-b292-aa39d0f9a41e",
	"name": "research remote",
	"values": [
		{
			"key": "pre_auth_endpoint",
			"value": "https://auth.research.identiproof.io/issuer/preauth",
			"type": "default",
			"enabled": true
		},
		{
			"key": "token_endpoint",
			"value": "https://auth.research.identiproof.io/oauth2/token",
			"type": "default",
			"enabled": true
		},
		{
			"key": "resource_endpoint",
			"value": "https://issuer.research.identiproof.io/credential",
			"type": "default",
			"enabled": true
		},
		{
			"key": "jwt_pop",
			"value": "",
			"type": "default",
			"enabled": true
		},
		{
			"key": "jwt_exp_sec",
			"value": "120",
			"type": "default",
			"enabled": true
		},
		{
			"key": "rs_priv_key",
			"value": "",
			"type": "secret",
			"enabled": true
		},
		{
			"key": "rs_pub_key",
			"value": "",
			"type": "default",
			"enabled": true
		},
		{
			"key": "user",
			"value": ":user",
			"type": "default",
			"enabled": true
		},
		{
			"key": "type",
			"value": "OpenBadgeCredential",
			"type": "default",
			"enabled": true
		},
		{
			"key": "issuer_uri",
			"value": "https://issuer.research.identiproof.io",
			"type": "default",
			"enabled": true
		}
	],
	"_postman_variable_scope": "environment",
	"_postman_exported_at": "2022-09-16T07:03:52.676Z",
	"_postman_exported_using": "Postman/9.29.0"
}