{
	"id": "f7d3b014-e560-4404-9978-25a153b2c8ed",
	"name": "local",
	"values": [
		{
			"key": "pre_auth_endpoint",
			"value": "http://localhost:9000/issuer/preauth\n",
			"type": "default",
			"enabled": true
		},
		{
			"key": "access_token",
			"value": "",
			"type": "any",
			"enabled": true
		},
		{
			"key": "token_endpoint",
			"value": "http://localhost:9000/oauth2/token",
			"type": "default",
			"enabled": true
		},
		{
			"key": "resource_endpoint",
			"value": "http://localhost:8090/credential",
			"type": "default",
			"enabled": true
		},
		{
			"key": "token",
			"value": "",
			"type": "default",
			"enabled": true
		},
		{
			"key": "jwt_pop",
			"value": "",
			"type": "default",
			"enabled": true
		},
		{
			"key": "nonce",
			"value": "example_nonce",
			"type": "default",
			"enabled": true
		},
		{
			"key": "jwt_exp_sec",
			"value": "120",
			"type": "default",
			"enabled": true
		},
		{
			"key": "rs_priv_key",
			"value": "",
			"type": "secret",
			"enabled": true
		},
		{
			"key": "rs_pub_key",
			"value": "",
			"type": "default",
			"enabled": true
		},
		{
			"key": "pre_auth_code",
			"value": "",
			"type": "default",
			"enabled": false
		}
	],
	"_postman_variable_scope": "environment",
	"_postman_exported_at": "2022-09-12T07:34:34.792Z",
	"_postman_exported_using": "Postman/9.29.0"
}