%YAML 1.1
%TAG !u! tag:unity3d.com,2011:
--- !u!114 &11400000
MonoBehaviour:
  m_ObjectHideFlags: 0
  m_CorrespondingSourceObject: {fileID: 0}
  m_PrefabInstance: {fileID: 0}
  m_PrefabAsset: {fileID: 0}
  m_GameObject: {fileID: 0}
  m_Enabled: 1
  m_EditorHideFlags: 0
  m_Script: {fileID: 11500000, guid: 27122c94fad0360499963919710724ad, type: 3}
  m_Name: T3
  m_EditorClassIdentifier: 
  health: 2000
  armor: 16
  damage: 175
  attackTime: 0.95
  attacckRange: 17
  projectileSpeed: 7.5
  teamGoldBounty: 140
  lastHitBounty: 200
  armorBonus: 5
  hpRegen: 0
  magicResist: 0.5
