C:\Users\veperam.ORADEV\Desktop\2020_Java_Programs\SELENIUM\src\main\java\TestNG\Activity1.java
C:\Users\veperam.ORADEV\Desktop\2020_Java_Programs\SELENIUM\src\main\java\com\selenium\UTILS\logIn.java
C:\Users\veperam.ORADEV\Desktop\2020_Java_Programs\SELENIUM\src\main\java\com\selenium\UTILS\BaseTest.java
C:\Users\veperam.ORADEV\Desktop\2020_Java_Programs\SELENIUM\src\main\java\com\selenium\UTILS\Methods.java
C:\Users\veperam.ORADEV\Desktop\2020_Java_Programs\SELENIUM\src\main\java\TestNG\Google_search.java
