{
    "name": "Tune Protect Travel Assurance - Platinum Plan",
    "fare": "160",
    "title": "Any trip is incomplete without Travel Assurance",
    "desc1": "Tune Protect Travel Assurance - Platinum Plan will provide you with the following:",
    "benefits": [{
        "fare": "USD 100,000",
        "detail": "for Accidental and Sickness Medical Reimbursement"
    }, {
        "fare": "USD 100,000",
        "detail": "for Emergency Medical Evacuation"
    }, {
        "fare": "USD 30,000",
        "detail": "for Accidental Death and Permanent Disablement"
    }],
    "desc2": "Tune Protect Travel Assurance - Platinum Plan is underwritten by a local insurance company."
}