[
    {
        "title": "Stops",
        "filters": [
            {
                "title": "Direct Flight",
                "price": "986"
      },
            {
                "title": "One Stop",
                "price": "946",
                "cheapest": true
      }
    ]
  },
    {
        "title": "Airport",
        "filters": [
            {
                "title": "Dubai",
                "price": "946",
                "cheapest": true
      }
    ]
  },
    {
        "title": "Airline",
        "filters": [
            {
                "title": "Jet Airways",
                "price": "946",
                "cheapest": true
      },
            {
                "title": "Emirates",
                "price": "1,266"
      },
            {
                "title": "SriLankan Airlines",
                "price": "993"
      },
            {
                "title": "Air India",
                "price": "986"
      },
            {
                "title": "Oman Air",
                "price": "1,416"
      },
            {
                "title": "Gulf Air",
                "price": "1,566"
      },
            {
                "title": "Kuwait Airways",
                "price": "1,683"
      }
    ]
  },
    {
        "title": "Departure flight take-off",
        "sliders": {
            "from": "02:45",
            "to": "23:40"
        }
  },
    {
        "title": "Return flight take-off",
        "sliders": {
            "from": "02:05",
            "to": "21:55"
        }
  },
    {
        "title": "Price Range",
        "sliders": {
            "from": "946",
            "to": "2046",
            "type": "currency"
        }
  }
]
