{
  "status": "SUCCESS",
  "code": null,
  "errorMessage": null,
  "errorDesc": null,
  "returnUrl": "/getHotelDetails",
  "message": "Hotel Retrieved Successfully",
  "data": {
    "city": "431374",
    "country": " AE",
    "countryCode": "AE",
    "totalRooms": 1,
    "currency": "AED",
    "totalPaxs": 1,
    "checkInDate": "11-Nov-2018",
    "checkOutDate": "20-Nov-2018",
    "nationality": null,
    "countryOfResidence": null,
    "duration": 9,
    "filterParams": {
      "hotelName": null,
      "starRatingBeans": [
        {
          "code": null,
          "value": "Official Visit England Rating",
          "minPrice": 511,
          "maxPrice": 2075,
          "count": 23
        },
        {
          "code": null,
          "value": "Official Visit Wales Rating",
          "minPrice": 782,
          "maxPrice": 5779,
          "count": 13
        },
        {
          "code": null,
          "value": "Official AA Rating",
          "minPrice": 575,
          "maxPrice": 854,
          "count": 9
        }
      ],
      "priceBean": {
        "minPrice": 511,
        "maxPrice": 5779,
        "currencyCode": null,
        "enabled": false,
        "isEnabledPrice": false
      },
      "amenityBeans": null,
      "providerBeans": [
        {
          "code": "YALAGO",
          "minPrice": 511,
          "maxPrice": 5779,
          "count": 45
        }
      ],
      "luxuryBeans": [
        {
          "value": "Non-Luxury",
          "minPrice": 511,
          "maxPrice": 5779,
          "count": 45
        }
      ],
      "fireSafetyBeans": null
    },
    "searchResults": [
      {
        "index": 0,
        "cityCode": "54634",
        "provider": "YALAGO",
        "htlCode": "2508795",
        "name": "Grand Central Hotel",
        "starRating": "Official Visit England Rating",
        "status": null,
        "htlDesc": "Grand Central Hotel is a 4 Star hotel with 163 beautifully decorated rooms, including 7 luxurious suites centrally located in the heart of Dubai. It is only a seven-minute drive away from the Dubai International Airport. Our guests can choose between our spacious Deluxe Double and Twin rooms as well as Executive and Presidential Suites, all of which are fully furnished to the highest standards, including flat-screen television, mini-bar, safe, satellite channels and high speed internet. Hotel facilities include a rooftop swimming pool and terrace, fitness centre and Spa, WiFi Internet, free basement parking and many more conveniences. Our restaurants offer a great range of Arabic, Continental, Iranian and Chinese cuisine and every night our guests can find live entertainment at our clubs and can also enjoy a great evening with family and friends at the Dragon Lounge offering a variety of Food and Beverages.We stand directly in one of the shopping and business districts of Dubai and are a short distance from the major shopping malls of the city. As we are only a 2-minute walk to Riqqa metro station, any point in Dubai is only a short metro ride away. Dubai has a wide range of landmarks and city attractions such as Desert Safari, Dhow Cruise, City Tours, Water and Adventure sports all of which can be booked easily through our in-house travel desk.With our professional service standards and our warm hospitality, your stay at Grand Central Hotel will surely be a happy, memorable and satisfying experience.",
        "address": "AL RIGGA ROAD DEIRA 185722 DUBAI  UNITED ARAB EMIR",
        "zcode": "185722",
        "phNo": "2306230",
        "builtYear": null,
        "floors": null,
        "roomsCount": "1",
        "luxury": false,
        "fireSafety": false,
        "preferred": false,
        "passengerNationality": null,
        "comments": null,
        "latitude": "25.263600",
        "longitude": "55.326800",
        "htlLoc": null,
        "checkInTime": null,
        "checkOutTime": null,
        "tpath": null,
        "htlContactDtls": {
          "email": [
            "info@grandcentraldxb.com"
          ],
          "url": null,
          "phNo": [
            "2306230"
          ]
        },
        "grsFare": 511,
        "totalFare": 511,
        "xmlCurrency": "USD",
        "convRate": 1,
        "servChrg": 0.00,
        "discount": 0.00,
        "markupAmount": 0,
        "offer": null,
        "offerDis": 0,
        "grsWithOutDiscount": 511.26,
        "offerDesc": null,
        "ircf": true,
        "amenities": null,
        "htlAmenities": [
          "Free Wi-Fi",
          "Wi-Fi",
          "Massage",
          "Gym",
          "Parking",
          "Wired Internet",
          "Air conditioning",
          "Television",
          "Bar",
          "Restaurant",
          "Meeting Rooms",
          "Telephone",
          "Currency Exchange",
          "Entertainment",
          "Newspaper",
          "Check-in",
          "Sun Bed",
          "Luggage",
          "Concierge",
          "Car Park",
          "24 Hour Reception",
          "Laundry",
          "Place of worship"
        ],
        "generalAmenities": null,
        "galleries": [
          {
            "path": "https://images.dnatatravel.com/ei/2/5/0/8/7/9/5/0.jpg",
            "text": null
          },
          {
            "path": "https://images.dnatatravel.com/ei/2/5/0/8/7/9/5/1.jpg",
            "text": null
          },
          {
            "path": "https://images.dnatatravel.com/ei/2/5/0/8/7/9/5/2.jpg",
            "text": null
          },
          {
            "path": "https://images.dnatatravel.com/ei/2/5/0/8/7/9/5/3.jpg",
            "text": null
          },
          {
            "path": "https://images.dnatatravel.com/ei/2/5/0/8/7/9/5/4.jpg",
            "text": null
          },
          {
            "path": "https://images.dnatatravel.com/ei/2/5/0/8/7/9/5/5.jpg",
            "text": null
          },
          {
            "path": "https://images.dnatatravel.com/ei/2/5/0/8/7/9/5/6.jpg",
            "text": null
          },
          {
            "path": "https://images.dnatatravel.com/ei/2/5/0/8/7/9/5/7.jpg",
            "text": null
          },
          {
            "path": "https://images.dnatatravel.com/ei/2/5/0/8/7/9/5/8.jpg",
            "text": null
          },
          {
            "path": "https://images.dnatatravel.com/ei/2/5/0/8/7/9/5/9.jpg",
            "text": null
          },
          {
            "path": "https://images.dnatatravel.com/ei/2/5/0/8/7/9/5/10.jpg",
            "text": null
          },
          {
            "path": "https://images.dnatatravel.com/ei/2/5/0/8/7/9/5/11.jpg",
            "text": null
          },
          {
            "path": "https://images.dnatatravel.com/ei/2/5/0/8/7/9/5/12.jpg",
            "text": null
          },
          {
            "path": "https://images.dnatatravel.com/ei/2/5/0/8/7/9/5/13.jpg",
            "text": null
          },
          {
            "path": "https://images.dnatatravel.com/ei/2/5/0/8/7/9/5/14.jpg",
            "text": null
          },
          {
            "path": "https://images.dnatatravel.com/ei/2/5/0/8/7/9/5/15.jpg",
            "text": null
          },
          {
            "path": "https://images.dnatatravel.com/ei/2/5/0/8/7/9/5/16.jpg",
            "text": null
          },
          {
            "path": "https://images.dnatatravel.com/ei/2/5/0/8/7/9/5/17.jpg",
            "text": null
          },
          {
            "path": "https://images.dnatatravel.com/ei/2/5/0/8/7/9/5/18.jpg",
            "text": null
          },
          {
            "path": "https://images.dnatatravel.com/ei/2/5/0/8/7/9/5/19.jpg",
            "text": null
          },
          {
            "path": "https://images.dnatatravel.com/ei/2/5/0/8/7/9/5/20.jpg",
            "text": null
          },
          {
            "path": "https://images.dnatatravel.com/ei/2/5/0/8/7/9/5/21.jpg",
            "text": null
          },
          {
            "path": "https://images.dnatatravel.com/ei/2/5/0/8/7/9/5/22.jpg",
            "text": null
          },
          {
            "path": "https://images.dnatatravel.com/ei/2/5/0/8/7/9/5/23.jpg",
            "text": null
          },
          {
            "path": "https://images.dnatatravel.com/ei/2/5/0/8/7/9/5/24.jpg",
            "text": null
          },
          {
            "path": "https://images.dnatatravel.com/ei/2/5/0/8/7/9/5/25.jpg",
            "text": null
          },
          {
            "path": "https://images.dnatatravel.com/ei/2/5/0/8/7/9/5/26.jpg",
            "text": null
          },
          {
            "path": "https://images.dnatatravel.com/ei/2/5/0/8/7/9/5/27.jpg",
            "text": null
          }
        ],
        "leisures": null,
        "attractions": null,
        "locations": [
          
        ],
        "nearestAirports": null,
        "nearestRailway": null,
        "occGroups": [
          {
            "roomGrpBean": {
              "roomDesc": null,
              "adultCount": 1,
              "childCount": 0,
              "infantCount": 0,
              "roomCount": 1,
              "childAges": "[]"
            },
            "roomInfos": [
              {
                "roomRefNo": "CgEx",
                "roomCode": "CE4SBzc1MTAzMTcaBzEzNjc0MDk=",
                "roomName": "Deluxe Double Room",
                "roomType": "Deluxe Double Room",
                "roomTypeCode": "CgEx",
                "rateBasis": null,
                "rateBasisCode": null,
                "mealBoard": null,
                "mealBoardDesc": "Room Only",
                "leftToSell": "7",
                "status": null,
                "adultCount": 1,
                "childCount": 0,
                "infantCount": 0,
                "xtraBeds": 0,
                "childAge": "[]",
                "roomImgPath": null,
                "roomTypeChar": null,
                "priceCode": null,
                "cancellationChrgCode": null,
                "psngrNamesRequird": 1,
                "roomCheckIn": 1541880000000,
                "roomCheckOut": 1542657600000,
                "checkInTime": null,
                "checkOutTime": null,
                "roomComments": null,
                "alertMsg": null,
                "paymentGuaranteedBy": null,
                "sharedBdng": false,
                "uniqueId": "CgEx",
                "onReq": false,
                "bkngId": null,
                "seqNo": null,
                "cancellationPolicy": "If cancelled   <b>Sun Nov 11 00:00:00 GST 2018</b> onwards, you will be charged 56.81 <br/>If cancelled on or before  <b>Fri Nov 09 00:00:00 GST 2018</b>  No Charge Applicable. <br/>",
                "amendmentPolicy": null,
                "allocations": null,
                "roomFare": 511.26,
                "penaltyAmount": 0,
                "servChrg": 0.00,
                "discount": 0.00,
                "servChrgType": null,
                "discChrgType": null,
                "servChrgKeys": null,
                "markupAmount": 0,
                "offerCode": null,
                "offerDiscount": null,
                "grsWithOutDiscount": 511.26,
                "roomFareDtls": null,
                "roomItems": null,
                "propertyList": [
                  
                ],
                "roomRunno": "1",
                "rateBasisRunno": null,
                "rawRoomFare": 511.26,
                "cancellationPolicies": [
                  {
                    "string": "If cancelled   <b>Sun Nov 11 00:00:00 GST 2018</b> onwards, you will be charged 56.81 <br/>",
                    "charge": 56.81,
                    "expiryDate": "2018-11-11T23:59:59"
                  },
                  {
                    "string": "If cancelled on or before  <b>Fri Nov 09 00:00:00 GST 2018</b>  No Charge Applicable. <br/>",
                    "charge": 0.00,
                    "expiryDate": "2018-11-09T23:59:59"
                  }
                ],
                "minStay": null,
                "dateApplyMinStay": null,
                "validRoomOccupancy": null,
                "updatedRoomFare": null,
                "nonRefundable": "false",
                "bookHash": null,
                "specialName": null,
                "payAtHotel": false,
                "bookingConditions": null,
                "roomAmenities": [
                  "Wi-Fi",
                  "Wired Internet",
                  "Bath",
                  "Wake Up Call",
                  "Shower",
                  "Cloakroom",
                  "Balcony/Terrace",
                  "Hairdryer",
                  "Ironing Facilities",
                  "Kettle",
                  "Tea and Coffee making facilities",
                  "Clock",
                  "Turndown service",
                  "Power Adaptor",
                  "Shaving Socket",
                  "Desk",
                  "Smoking Policy",
                  "Lounge",
                  "Heating",
                  "Room Service"
                ],
                "isBindingPrice": false
              },
              {
                "roomRefNo": "CgEy",
                "roomCode": "CE4SBzc1MTAzMTcaBzEzNjc0MDk=",
                "roomName": "Deluxe Double Room",
                "roomType": "Deluxe Double Room",
                "roomTypeCode": "CgEy",
                "rateBasis": null,
                "rateBasisCode": null,
                "mealBoard": null,
                "mealBoardDesc": "Bed And Breakfast",
                "leftToSell": "7",
                "status": null,
                "adultCount": 1,
                "childCount": 0,
                "infantCount": 0,
                "xtraBeds": 0,
                "childAge": "[]",
                "roomImgPath": null,
                "roomTypeChar": null,
                "priceCode": null,
                "cancellationChrgCode": null,
                "psngrNamesRequird": 1,
                "roomCheckIn": 1541880000000,
                "roomCheckOut": 1542657600000,
                "checkInTime": null,
                "checkOutTime": null,
                "roomComments": null,
                "alertMsg": null,
                "paymentGuaranteedBy": null,
                "sharedBdng": false,
                "uniqueId": "CgEy",
                "onReq": false,
                "bkngId": null,
                "seqNo": null,
                "cancellationPolicy": "If cancelled   <b>Sun Nov 11 00:00:00 GST 2018</b> onwards, you will be charged 68.98 <br/>If cancelled on or before  <b>Fri Nov 09 00:00:00 GST 2018</b>  No Charge Applicable. <br/>",
                "amendmentPolicy": null,
                "allocations": null,
                "roomFare": 620.81,
                "penaltyAmount": 0,
                "servChrg": 0.00,
                "discount": 0.00,
                "servChrgType": null,
                "discChrgType": null,
                "servChrgKeys": null,
                "markupAmount": 0,
                "offerCode": null,
                "offerDiscount": null,
                "grsWithOutDiscount": 620.81,
                "roomFareDtls": null,
                "roomItems": null,
                "propertyList": [
                  
                ],
                "roomRunno": "2",
                "rateBasisRunno": null,
                "rawRoomFare": 620.81,
                "cancellationPolicies": [
                  {
                    "string": "If cancelled   <b>Sun Nov 11 00:00:00 GST 2018</b> onwards, you will be charged 68.98 <br/>",
                    "charge": 68.98,
                    "expiryDate": "2018-11-11T23:59:59"
                  },
                  {
                    "string": "If cancelled on or before  <b>Fri Nov 09 00:00:00 GST 2018</b>  No Charge Applicable. <br/>",
                    "charge": 0.00,
                    "expiryDate": "2018-11-09T23:59:59"
                  }
                ],
                "minStay": null,
                "dateApplyMinStay": null,
                "validRoomOccupancy": null,
                "updatedRoomFare": null,
                "nonRefundable": "false",
                "bookHash": null,
                "specialName": null,
                "payAtHotel": false,
                "bookingConditions": null,
                "roomAmenities": [
                  "Wi-Fi",
                  "Wired Internet",
                  "Bath",
                  "Wake Up Call",
                  "Shower",
                  "Cloakroom",
                  "Balcony/Terrace",
                  "Hairdryer",
                  "Ironing Facilities",
                  "Kettle",
                  "Tea and Coffee making facilities",
                  "Clock",
                  "Turndown service",
                  "Power Adaptor",
                  "Shaving Socket",
                  "Desk",
                  "Smoking Policy",
                  "Lounge",
                  "Heating",
                  "Room Service"
                ],
                "isBindingPrice": false
              },
              {
                "roomRefNo": "CgEz",
                "roomCode": "CE4SBzc1MTAzMTcaBzEzNjc0MDk=",
                "roomName": "Deluxe Double Room",
                "roomType": "Deluxe Double Room",
                "roomTypeCode": "CgEz",
                "rateBasis": null,
                "rateBasisCode": null,
                "mealBoard": null,
                "mealBoardDesc": "Half Board",
                "leftToSell": "7",
                "status": null,
                "adultCount": 1,
                "childCount": 0,
                "infantCount": 0,
                "xtraBeds": 0,
                "childAge": "[]",
                "roomImgPath": null,
                "roomTypeChar": null,
                "priceCode": null,
                "cancellationChrgCode": null,
                "psngrNamesRequird": 1,
                "roomCheckIn": 1541880000000,
                "roomCheckOut": 1542657600000,
                "checkInTime": null,
                "checkOutTime": null,
                "roomComments": null,
                "alertMsg": null,
                "paymentGuaranteedBy": null,
                "sharedBdng": false,
                "uniqueId": "CgEz",
                "onReq": false,
                "bkngId": null,
                "seqNo": null,
                "cancellationPolicy": "If cancelled   <b>Sun Nov 11 00:00:00 GST 2018</b> onwards, you will be charged 74.39 <br/>If cancelled on or before  <b>Fri Nov 09 00:00:00 GST 2018</b>  No Charge Applicable. <br/>",
                "amendmentPolicy": null,
                "allocations": null,
                "roomFare": 669.50,
                "penaltyAmount": 0,
                "servChrg": 0.00,
                "discount": 0.00,
                "servChrgType": null,
                "discChrgType": null,
                "servChrgKeys": null,
                "markupAmount": 0,
                "offerCode": null,
                "offerDiscount": null,
                "grsWithOutDiscount": 669.50,
                "roomFareDtls": null,
                "roomItems": null,
                "propertyList": [
                  
                ],
                "roomRunno": "3",
                "rateBasisRunno": null,
                "rawRoomFare": 669.50,
                "cancellationPolicies": [
                  {
                    "string": "If cancelled   <b>Sun Nov 11 00:00:00 GST 2018</b> onwards, you will be charged 74.39 <br/>",
                    "charge": 74.39,
                    "expiryDate": "2018-11-11T23:59:59"
                  },
                  {
                    "string": "If cancelled on or before  <b>Fri Nov 09 00:00:00 GST 2018</b>  No Charge Applicable. <br/>",
                    "charge": 0.00,
                    "expiryDate": "2018-11-09T23:59:59"
                  }
                ],
                "minStay": null,
                "dateApplyMinStay": null,
                "validRoomOccupancy": null,
                "updatedRoomFare": null,
                "nonRefundable": "false",
                "bookHash": null,
                "specialName": null,
                "payAtHotel": false,
                "bookingConditions": null,
                "roomAmenities": [
                  "Wi-Fi",
                  "Wired Internet",
                  "Bath",
                  "Wake Up Call",
                  "Shower",
                  "Cloakroom",
                  "Balcony/Terrace",
                  "Hairdryer",
                  "Ironing Facilities",
                  "Kettle",
                  "Tea and Coffee making facilities",
                  "Clock",
                  "Turndown service",
                  "Power Adaptor",
                  "Shaving Socket",
                  "Desk",
                  "Smoking Policy",
                  "Lounge",
                  "Heating",
                  "Room Service"
                ],
                "isBindingPrice": false
              }
            ]
          }
        ],
        "passengerCountry": null,
        "checkInDate": null,
        "checkOutDate": null,
        "rawFare": 511.26,
        "url": null,
        "userName": null,
        "password": null
      }
    ],
    "status": null,
    "statusCode": null,
    "returnUrl": null,
    "displayMsg": null,
    "requestMode": null,
    "reqCommand": null,
    "appMode": null
  }
}