{
  "status": "SUCCESS",
  "code": null,
  "errorMessage": null,
  "errorDesc": null,
  "returnUrl": null,
  "message": "Booking Retrieved Successfully",
  "data": {
    "clientRefNo": "PF-27062018-2464",
    "docketNo": "3826",
    "pnrNo": "LITTQQ",
    "gdsRefNo": null,
    "bkngRef": null,
    "adtCnt": 1,
    "isExternalBkng": false,
    "chldCnt": 0,
    "infntCnt": 0,
    "dateOfBkng": "27-Jun-2018",
    "classType": "Economy",
    "searchType": "One way",
    "trvlType": null,
    "bkngStatus": "TICKETED",
    "currency": null,
    "grandTot": 49,
    "servChrg": 0.00,
    "markUp": 0.00,
    "discnt": 0.00,
    "prvdrCode": "SAB",
    "servChrgMode": 0,
    "platingAirv": "9W",
    "segLst": [
      {
        "origin": "Bahrain (BAH) , Bahrain",
        "dest": "Chennai (MAA) , India",
        "startDt": "20180928",
        "endDt": "20180929",
        "startTime": "22:40",
        "arrivalTime": "18:35",
        "airline": "9W",
        "airlineName": "Jet Airways",
        "stops": "1",
        "totFlyDuration": "345",
        "dispTotFlyDuration": "05h 45m",
        "totTransitDuration": 0,
        "dispTotTransDuration": "",
        "routes": [
          "BAH",
          "BOM",
          "MAA"
        ],
        "nextDay": "29 Sep",
        "nonRef": null,
        "fltInfoList": [
          {
            "origin": "Bahrain (BAH) , Bahrain",
            "dest": "Bombay (BOM) , India",
            "dispStartDate": "Fri, 28 Sep, 2018",
            "dispEndDate": "Sat, 29 Sep, 2018",
            "dispStartTime": "22:40",
            "dispArrTime": "04:45",
            "rawDeptDate": null,
            "rawArrivalDate": null,
            "duration": 215,
            "dispDuration": "03h 35m",
            "transitDuration": "0",
            "dispTransitDuration": "",
            "connInd": "Y",
            "stTime": "22:40",
            "arrTime": "04:45",
            "airline": "9W",
            "airlineName": "Jet Airways",
            "fltNum": "0591",
            "opAirln": null,
            "opAirlnName": null,
            "opFltNum": null,
            "equip": "73H",
            "aircraftType": "Boeing 737-800       ",
            "stTerminal": null,
            "endTrmnl": "Terminal-2",
            "fltClsCode": "W",
            "stopOver": false,
            "distance": null,
            "fareBasis": null,
            "chngOfPlanes": false,
            "airlnPnr": "MMTRLB",
            "statsCode": "CONFIRMED",
            "rph": null,
            "uapiSegmentKey": null,
            "uapiAirSegment": null,
            "bagUnit": "K",
            "bagWeight": "30",
            "startDt": "20180928",
            "endDt": "20180929",
            "stopOverFlts": null
          },
          {
            "origin": "Bombay (BOM) , India",
            "dest": "Chennai (MAA) , India",
            "dispStartDate": "Sat, 29 Sep, 2018",
            "dispEndDate": "Sat, 29 Sep, 2018",
            "dispStartTime": "16:25",
            "dispArrTime": "18:35",
            "rawDeptDate": null,
            "rawArrivalDate": null,
            "duration": 130,
            "dispDuration": "02h 10m",
            "transitDuration": "0",
            "dispTransitDuration": "",
            "connInd": "N",
            "stTime": "16:25",
            "arrTime": "18:35",
            "airline": "9W",
            "airlineName": "Jet Airways",
            "fltNum": "0469",
            "opAirln": null,
            "opAirlnName": null,
            "opFltNum": null,
            "equip": "73H",
            "aircraftType": "Boeing 737-800       ",
            "stTerminal": "Terminal-2",
            "endTrmnl": "Terminal-1",
            "fltClsCode": "W",
            "stopOver": false,
            "distance": null,
            "fareBasis": null,
            "chngOfPlanes": false,
            "airlnPnr": "MMTRLB",
            "statsCode": "CONFIRMED",
            "rph": null,
            "uapiSegmentKey": null,
            "uapiAirSegment": null,
            "bagUnit": "K",
            "bagWeight": "30",
            "startDt": "20180929",
            "endDt": "20180929",
            "stopOverFlts": null
          }
        ],
        "bagUnit": "K",
        "bagWeight": "30",
        "preferredAirLine": false
      }
    ],
    "psgrLst": [
      {
        "travelerRefNo": "5895322797542",
        "title": "MR",
        "email": "PGCHITU@HOTMAIL.COM",
        "dob": null,
        "age": null,
        "nationality": null,
        "passportNo": "H838939829",
        "frequentFlyerNo": null,
        "phoneNumber": "9840921433",
        "specialRequests": null,
        "firstName": "CHITARANJAN",
        "lastName": "G",
        "index": null,
        "passengerType": "Adult",
        "costCentre": null,
        "status": "TICKETED",
        "ticketedOn": null,
        "voidedOn": null,
        "frequentFlyerList": null,
        "travellerRefRPH": null,
        "totalBaggageFare": 0.00,
        "totalSeatMapFare": 0.00,
        "totalMealFare": 0.00,
        "totalFare": 49.00,
        "ssrDetailList": null,
        "bookingAirSSRDtlsBeanList": null
      }
    ],
    "fareInfoLst": [
      {
        "passengerType": "Adult",
        "passengerCount": 1,
        "baseFare": "12.00",
        "taxFare": "37.00",
        "totFare": "49.00",
        "totPsgrsFare": "49.00",
        "serviceCharge": 0.00,
        "discount": 0.00,
        "taxBreakups": [
          {
            "countryCode": ".000YQ",
            "breakupAmt": "27.00"
          },
          {
            "countryCode": ".000YR",
            "breakupAmt": "3.00"
          },
          {
            "countryCode": ".000BH",
            "breakupAmt": "7.00"
          }
        ],
        "currencyCode": null,
        "changePenalty": null,
        "cancelPenalty": null,
        "refundable": false,
        "rawBaseFare": null,
        "travellerRefNo": null,
        "totalBaggageAmt": 0.00,
        "totalSeatAmt": 0,
        "totalMealAmt": 0,
        "markup": 0,
        "privateFare": null,
        "customTaxApplied": false,
        "fareInfoRefKey": null
      }
    ],
    "fareRules": [
      {
        "content": "NOTE - THE FOLLOWING TEXT IS INFORMATIONAL AND NOT\nVALIDATED FOR AUTOPRICING.\nJET AIRWAYS BRAND - ECONOMY DEAL.\nAPPLICATION\nCLASS OF SERVICE\nTHESE FARES APPLY FOR ECONOMY CLASS SERVICE.\nTYPES OF TRANSPORTATION\nTHIS RULE GOVERNS ONE-WAY AND ROUND-TRIP FARES.\nCAPACITY LIMITATIONS\nTHE CARRIER SHALL LIMIT THE NUMBER OF PASSENGERS\nCARRIED ON ANY ONE FLIGHT AT FARES GOVERNED BY\nTHIS RULE AND SUCH FARES WILL NOT NECESSARILY BE\nAVAILABLE ON ALL FLIGHTS. THE NUMBER OF SEATS,\nWHICH THE CARRIER SHALL MAKE AVAILABLE ON A GIVEN\nFLIGHT, WILL BE DETERMINED BY THE CARRIER'S BEST\nJUDGEMENT.\nOTHER CONDITIONS\nPROGRAM NAME - ECONOMY DEAL\nMILEAGE ACCRUAL          - 25 PERCENT\nUPGRADE ELIGIBILITY      - NOT OFFERED\nPRIORITY CHECKIN         - NOT OFFERED\nBAGGAGE                  - OFFERED FREE\nLOUNGE                   - NOT OFFERED\nNOTE- THE BRAND ATTRIBUTES APPLIES TO JET AIRWAYS\nONLINE ROUTES.\nEXCESS BAGGAGE CHARGE WILL APPLY IF BAGGAGE\nEXCEEDS THE OFFERED WEIGHT/PIECE LIMIT.\n.....\nALL FARES / CHARGES AND CONDITIONS ARE SUBJECT TO\nCHANGE OR WITHDRAWAL WITHOUT PRIOR NOTICE.\n.....\nFOR POINT OF SALE INDIA -\nA TRANSACTION FEE OF UPTO 3.5 PCT IS APPLICABLE.",
        "headerText": "RULE-50"
      },
      {
        "content": "NO ELIGIBILITY REQUIREMENTS APPLY.",
        "headerText": "RULE-1"
      },
      {
        "content": "NO DAY/TIME TRAVEL RESTRICTIONS APPLY.",
        "headerText": "RULE-2"
      },
      {
        "content": "NO SEASONAL TRAVEL RESTRICTIONS APPLY.",
        "headerText": "RULE-3"
      },
      {
        "content": "THE FARE COMPONENT MUST NOT BE ON\nONE OR MORE OF THE FOLLOWING\n9W FLIGHTS 179 THROUGH 180.\nAND\nTHE FARE COMPONENT MUST BE ON\nONE OR MORE OF THE FOLLOWING\nANY 9W FLIGHT OPERATED BY 9W\nANY 9W FLIGHT OPERATED BY S2.",
        "headerText": "RULE-4"
      },
      {
        "content": "CONFIRMED RESERVATIONS ARE REQUIRED FOR ALL SECTORS.\nNOTE - TEXT BELOW NOT VALIDATED FOR AUTOPRICING.\nPASSENGERS FULL NAME AS MENTIONED IN THE PASSPORT\nMUST BE ENTERED IN THE PNR NAME FIELD.\n9W RESERVES THE RIGHT TO CANCEL ANY PNR WHERE\nITINERARY DOES NOT COMPLY WITH RESERVATION\nBOOKING CODE -RBD-.IF A TICKET IS USED OUT OF\nSEQUENCE 9W RESERVES THE RIGHT TO CANCEL ANY PNR\nOR INVALIDATE THE REMAINING FLIGHT COUPONS.IF A\nPASSENGER FAILS TO TRAVEL ON A SECTOR BOOKED 9W\nRESERVES THE RIGHT TO CANCEL REMAINING 9W SECTORS.",
        "headerText": "RULE-5"
      },
      {
        "content": "NO MINIMUM STAY REQUIREMENTS APPLY.",
        "headerText": "RULE-6"
      },
      {
        "content": "NO MAXIMUM STAY REQUIREMENTS APPLY.",
        "headerText": "RULE-7"
      },
      {
        "content": "NO STOPOVERS PERMITTED ON THE PRICING UNIT.",
        "headerText": "RULE-8"
      },
      {
        "content": "UNLIMITED TRANSFERS PERMITTED ON THE PRICING UNIT.\nFARE BREAK AND EMBEDDED SURFACE SECTORS NOT PERMITTED\nON THE FARE COMPONENT.",
        "headerText": "RULE-9"
      },
      {
        "content": "SINGLE/DOUBLE OPEN JAWS/ROUND TRIPS/CIRCLE TRIPS NOT\nPERMITTED.\nEND-ON-END\nEND-ON-END COMBINATIONS PERMITTED WITH DOMESTIC\nFARES. VALIDATE ALL FARE COMPONENTS. SIDE TRIPS NOT\nPERMITTED.\nPROVIDED -\nCOMBINATIONS ARE FOR CARRIER 9W IN ANY RULE IN ANY\nTARIFF.\nCOMBINATIONS ARE FOR CARRIER EY WITH ANY RULE IN\nANY PUBLIC TARIFF.",
        "headerText": "RULE-10"
      },
      {
        "content": "OUTBOUND -\nTRAVEL IS NOT PERMITTED 16AUG18 THROUGH 22AUG18 OR\n13DEC18 THROUGH 24DEC18.\nINBOUND -\nTRAVEL IS NOT PERMITTED 01JAN18 THROUGH 07JAN18 OR\n22AUG18 THROUGH 17SEP18 OR 29DEC18 THROUGH 14JAN19.",
        "headerText": "RULE-11"
      },
      {
        "content": "FARE RULE\nOUTBOUND -\nWEEKEND SURCHARGE OF USD 20.00 WILL BE ADDED TO THE\nAPPLICABLE FARE PER ADULT,ALLOWING CHILD/INFANT\nDISCOUNTS ON THU.\nNOTE - TEXT BELOW NOT VALIDATED FOR AUTOPRICING.\nALL SURCHARGES MENTIONED ACCRUE TO 9W ONLY.\nAND - INBOUND -\nWEEKEND SURCHARGE OF USD 20.00 WILL BE ADDED TO THE\nAPPLICABLE FARE PER ADULT,ALLOWING CHILD/INFANT\nDISCOUNTS ON SAT.\nNOTE - TEXT BELOW NOT VALIDATED FOR AUTOPRICING.\nALL SURCHARGES MENTIONED ACCRUE TO 9W ONLY.\nGENERAL RULE - APPLY UNLESS OTHERWISE SPECIFIED\nTHE PROVISIONS BELOW APPLY ONLY AS FOLLOWS -\nTICKETS MUST BE ISSUED ON THE STOCK OF 9W OR HR.\nAND\nIF THE FARE COMPONENT INCLUDES TRAVEL VIA BOM/AMD/NAG/\nIDR\nTHEN THAT TRAVEL MUST BE ON\nONE OR MORE OF THE FOLLOWING\n9W FLIGHT 307 OPERATED BY 9W\n9W FLIGHT 309 OPERATED BY 9W\n9W FLIGHT 334 OPERATED BY 9W\n9W FLIGHT 345 OPERATED BY 9W\n9W FLIGHT 349 OPERATED BY 9W\n9W FLIGHT 355 OPERATED BY 9W\n9W FLIGHT 397 OPERATED BY 9W\n9W FLIGHT 411 OPERATED BY 9W\n9W FLIGHT 412 OPERATED BY 9W\n9W FLIGHT 416 OPERATED BY 9W\n9W FLIGHT 460 OPERATED BY 9W\n9W FLIGHT 461 OPERATED BY 9W\n9W FLIGHT 469 OPERATED BY 9W\n9W FLIGHT 489 OPERATED BY 9W\n9W FLIGHT 617 OPERATED BY 9W\n9W FLIGHT 618 OPERATED BY 9W\n9W FLIGHT 2385 OPERATED BY 9W\n9W FLIGHT 340 OPERATED BY 9W\n9W FLIGHT 414 OPERATED BY 9W\n9W FLIGHT 826 OPERATED BY 9W\n9W FLIGHT 472 OPERATED BY 9W\n9W FLIGHT 358 OPERATED BY 9W\n9W FLIGHT 762 OPERATED BY 9W\n9W FLIGHT 2349 OPERATED BY 9W\n9W FLIGHT 413 OPERATED BY 9W\n9W FLIGHT 311 OPERATED BY 9W\n9W FLIGHT 708 OPERATED BY 9W\n9W FLIGHT 705 OPERATED BY 9W\n9W FLIGHT 132 OPERATED BY 9W\n9W FLIGHT 131 OPERATED BY 9W\n9W FLIGHT 932 OPERATED BY 9W\n9W FLIGHT 719 OPERATED BY 9W\n9W FLIGHT 709 OPERATED BY 9W\n9W FLIGHT 147 OPERATED BY 9W\n9W FLIGHT 710 OPERATED BY 9W\n9W FLIGHT 148 OPERATED BY 9W\nON DIRECT FLIGHTS.\nMISCELLANEOUS/OTHER SURCHARGE OF USD 55.00 WILL BE\nADDED TO THE APPLICABLE FARE PER ANY PASSENGER.\nNOTE - TEXT BELOW NOT VALIDATED FOR AUTOPRICING.\nALL SURCHARGES MENTIONED ACCRUE TO 9W ONLY.\nTHE PROVISIONS BELOW APPLY ONLY AS FOLLOWS -\nTICKETS MUST BE ISSUED ON THE STOCK OF 9W OR HR.\nAND\nIF THE FARE COMPONENT INCLUDES TRAVEL VIA BLR/GAU/PNQ/\nCCU\nTHEN THAT TRAVEL MUST BE ON\nONE OR MORE OF THE FOLLOWING\n9W FLIGHT 823 OPERATED BY 9W\n9W FLIGHT 824 OPERATED BY 9W\n9W FLIGHT 2479 OPERATED BY 9W\n9W FLIGHT 2480 OPERATED BY 9W\n9W FLIGHT 2491 OPERATED BY 9W\n9W FLIGHT 2492 OPERATED BY 9W\n9W FLIGHT 2736 OPERATED BY 9W\n9W FLIGHT 364 OPERATED BY 9W\n9W FLIGHT 363 OPERATED BY 9W\n9W FLIGHT 680 OPERATED BY 9W\n9W FLIGHT 491 OPERATED BY 9W\n9W FLIGHT 982 OPERATED BY 9W\n9W FLIGHT 981 OPERATED BY 9W\n9W FLIGHT 872 OPERATED BY 9W\n9W FLIGHT 853 OPERATED BY 9W\n9W FLIGHT 659 OPERATED BY 9W\n9W FLIGHT 921 OPERATED BY 9W\n9W FLIGHT 935 OPERATED BY 9W\n9W FLIGHT 854 OPERATED BY 9W\n9W FLIGHT 675 OPERATED BY 9W\n9W FLIGHT 669 OPERATED BY 9W\n9W FLIGHT 917 OPERATED BY 9W\n9W FLIGHT 605 OPERATED BY 9W\n9W FLIGHT 827 OPERATED BY 9W\n9W FLIGHT 802 OPERATED BY 9W\n9W FLIGHT 842 OPERATED BY 9W\n9W FLIGHT 660 OPERATED BY 9W\n9W FLIGHT 779 OPERATED BY 9W\n9W FLIGHT 606 OPERATED BY 9W\n9W FLIGHT 944 OPERATED BY 9W\n9W FLIGHT 918 OPERATED BY 9W\n9W FLIGHT 936 OPERATED BY 9W\nON DIRECT FLIGHTS.\nMISCELLANEOUS/OTHER SURCHARGE OF USD 55.00 WILL BE\nADDED TO THE APPLICABLE FARE PER ANY PASSENGER.\nNOTE - TEXT BELOW NOT VALIDATED FOR AUTOPRICING.\nALL SURCHARGES MENTIONED ACCRUE TO 9W ONLY.\nTHE PROVISIONS BELOW APPLY ONLY AS FOLLOWS -\nTICKETS MUST BE ISSUED ON THE STOCK OF 9W OR HR.\nAND\nIF THE FARE COMPONENT INCLUDES TRAVEL VIA DEL/BDQ/JAI/\nVNS\nTHEN THAT TRAVEL MUST BE ON\nONE OR MORE OF THE FOLLOWING\n9W FLIGHT 367 OPERATED BY 9W\n9W FLIGHT 373 OPERATED BY 9W\n9W FLIGHT 739 OPERATED BY 9W\n9W FLIGHT 740 OPERATED BY 9W\n9W FLIGHT 644 OPERATED BY 9W\n9W FLIGHT 762 OPERATED BY 9W\n9W FLIGHT 655 OPERATED BY 9W\n9W FLIGHT 795 OPERATED BY 9W\n9W FLIGHT 809 OPERATED BY 9W\n9W FLIGHT 824 OPERATED BY 9W\n9W FLIGHT 820 OPERATED BY 9W\n9W FLIGHT 333 OPERATED BY 9W\n9W FLIGHT 364 OPERATED BY 9W\n9W FLIGHT 857 OPERATED BY 9W\n9W FLIGHT 652 OPERATED BY 9W\n9W FLIGHT 856 OPERATED BY 9W\n9W FLIGHT 312 OPERATED BY 9W\n9W FLIGHT 366 OPERATED BY 9W\n9W FLIGHT 715 OPERATED BY 9W\n9W FLIGHT 139 OPERATED BY 9W\n9W FLIGHT 140 OPERATED BY 9W\n9W FLIGHT 785 OPERATED BY 9W\n9W FLIGHT 145 OPERATED BY 9W\n9W FLIGHT 146 OPERATED BY 9W\n9W FLIGHT 924 OPERATED BY 9W\n9W FLIGHT 375 OPERATED BY 9W\n9W FLIGHT 370 OPERATED BY 9W\nON DIRECT FLIGHTS.\nMISCELLANEOUS/OTHER SURCHARGE OF USD 55.00 WILL BE\nADDED TO THE APPLICABLE FARE PER ANY PASSENGER.\nNOTE - TEXT BELOW NOT VALIDATED FOR AUTOPRICING.\nALL SURCHARGES MENTIONED ACCRUE TO 9W ONLY.\nTHE PROVISIONS BELOW APPLY ONLY AS FOLLOWS -\nTICKETS MUST BE ISSUED ON THE STOCK OF 9W OR HR.\nAND\nIF THE FARE COMPONENT INCLUDES TRAVEL VIA BHO/RPR/IMF/\nMAA\nTHEN THAT TRAVEL MUST BE ON\nONE OR MORE OF THE FOLLOWING\n9W FLIGHT 2121 OPERATED BY 9W\n9W FLIGHT 2843 OPERATED BY 9W\n9W FLIGHT 759 OPERATED BY 9W\n9W FLIGHT 799 OPERATED BY 9W\nON DIRECT FLIGHTS.\nMISCELLANEOUS/OTHER SURCHARGE OF USD 55.00 WILL BE\nADDED TO THE APPLICABLE FARE PER ANY PASSENGER.\nNOTE - TEXT BELOW NOT VALIDATED FOR AUTOPRICING.\nALL SURCHARGES MENTIONED ACCRUE TO 9W ONLY.\nTHE PROVISIONS BELOW APPLY ONLY AS FOLLOWS -\nTICKETS MUST BE ISSUED ON THE STOCK OF 9W OR HR.\nTHERE IS NO FUEL SURCHARGE PER ANY PASSENGER.\nNOTE - TEXT BELOW NOT VALIDATED FOR AUTOPRICING.\nALL SURCHARGES MENTIONED ACCRUE TO 9W ONLY.\nIF INFANT WITHOUT A SEAT PSGR UNDER 2.\nMISCELLANEOUS/OTHER SURCHARGE OF USD 20.00 PER FARE\nCOMPONENT WILL BE ADDED TO THE APPLICABLE FARE PER\nANY PASSENGER.\nNOTE - TEXT BELOW NOT VALIDATED FOR AUTOPRICING.\nALL SURCHARGES MENTIONED ACCRUE TO 9W ONLY.\nORIGINATING BAH -\nIF THE FARE COMPONENT INCLUDES TRAVEL VIA BOM/AMD/NAG/\nIDR\nTHEN THAT TRAVEL MUST BE ON\nONE OR MORE OF THE FOLLOWING\n9W FLIGHT 307 OPERATED BY 9W\n9W FLIGHT 309 OPERATED BY 9W\n9W FLIGHT 334 OPERATED BY 9W\n9W FLIGHT 345 OPERATED BY 9W\n9W FLIGHT 349 OPERATED BY 9W\n9W FLIGHT 355 OPERATED BY 9W\n9W FLIGHT 397 OPERATED BY 9W\n9W FLIGHT 411 OPERATED BY 9W\n9W FLIGHT 412 OPERATED BY 9W\n9W FLIGHT 416 OPERATED BY 9W\n9W FLIGHT 460 OPERATED BY 9W\n9W FLIGHT 461 OPERATED BY 9W\n9W FLIGHT 469 OPERATED BY 9W\n9W FLIGHT 489 OPERATED BY 9W\n9W FLIGHT 617 OPERATED BY 9W\n9W FLIGHT 618 OPERATED BY 9W\n9W FLIGHT 2385 OPERATED BY 9W\n9W FLIGHT 340 OPERATED BY 9W\n9W FLIGHT 414 OPERATED BY 9W\n9W FLIGHT 826 OPERATED BY 9W\n9W FLIGHT 472 OPERATED BY 9W\n9W FLIGHT 358 OPERATED BY 9W\n9W FLIGHT 762 OPERATED BY 9W\n9W FLIGHT 2349 OPERATED BY 9W\n9W FLIGHT 413 OPERATED BY 9W\n9W FLIGHT 311 OPERATED BY 9W\n9W FLIGHT 708 OPERATED BY 9W\n9W FLIGHT 705 OPERATED BY 9W\n9W FLIGHT 132 OPERATED BY 9W\n9W FLIGHT 131 OPERATED BY 9W\n9W FLIGHT 932 OPERATED BY 9W\n9W FLIGHT 719 OPERATED BY 9W\n9W FLIGHT 709 OPERATED BY 9W\n9W FLIGHT 147 OPERATED BY 9W\n9W FLIGHT 710 OPERATED BY 9W\n9W FLIGHT 148 OPERATED BY 9W\nON DIRECT FLIGHTS.\nMISCELLANEOUS/OTHER SURCHARGE OF USD 55.00 WILL BE\nADDED TO THE APPLICABLE FARE PER ANY PASSENGER.\nNOTE - TEXT BELOW NOT VALIDATED FOR AUTOPRICING.\nALL SURCHARGES MENTIONED ACCRUE TO 9W ONLY.\nAND - FUEL SURCHARGE OF BHD 19.000 PER DIRECTION WILL\nBE ADDED TO THE APPLICABLE FARE PER ANY\nPASSENGER.\nNOTE - TEXT BELOW NOT VALIDATED FOR AUTOPRICING.\nALL SURCHARGES MENTIONED ACCRUE TO 9W ONLY.\nORIGINATING BAH -\nIF THE FARE COMPONENT INCLUDES TRAVEL VIA BLR/GAU/PNQ/\nCCU\nTHEN THAT TRAVEL MUST BE ON\nONE OR MORE OF THE FOLLOWING\n9W FLIGHT 823 OPERATED BY 9W\n9W FLIGHT 824 OPERATED BY 9W\n9W FLIGHT 2479 OPERATED BY 9W\n9W FLIGHT 2480 OPERATED BY 9W\n9W FLIGHT 2491 OPERATED BY 9W\n9W FLIGHT 2492 OPERATED BY 9W\n9W FLIGHT 2736 OPERATED BY 9W\n9W FLIGHT 364 OPERATED BY 9W\n9W FLIGHT 363 OPERATED BY 9W\n9W FLIGHT 680 OPERATED BY 9W\n9W FLIGHT 491 OPERATED BY 9W\n9W FLIGHT 982 OPERATED BY 9W\n9W FLIGHT 981 OPERATED BY 9W\n9W FLIGHT 872 OPERATED BY 9W\n9W FLIGHT 853 OPERATED BY 9W\n9W FLIGHT 659 OPERATED BY 9W\n9W FLIGHT 921 OPERATED BY 9W\n9W FLIGHT 935 OPERATED BY 9W\n9W FLIGHT 854 OPERATED BY 9W\n9W FLIGHT 675 OPERATED BY 9W\n9W FLIGHT 669 OPERATED BY 9W\n9W FLIGHT 917 OPERATED BY 9W\n9W FLIGHT 605 OPERATED BY 9W\n9W FLIGHT 827 OPERATED BY 9W\n9W FLIGHT 802 OPERATED BY 9W\n9W FLIGHT 842 OPERATED BY 9W\n9W FLIGHT 660 OPERATED BY 9W\n9W FLIGHT 779 OPERATED BY 9W\n9W FLIGHT 606 OPERATED BY 9W\n9W FLIGHT 944 OPERATED BY 9W\n9W FLIGHT 918 OPERATED BY 9W\n9W FLIGHT 936 OPERATED BY 9W\nON DIRECT FLIGHTS.\nMISCELLANEOUS/OTHER SURCHARGE OF USD 55.00 WILL BE\nADDED TO THE APPLICABLE FARE PER ANY PASSENGER.\nNOTE - TEXT BELOW NOT VALIDATED FOR AUTOPRICING.\nALL SURCHARGES MENTIONED ACCRUE TO 9W ONLY.\nAND - FUEL SURCHARGE OF BHD 19.000 PER DIRECTION WILL\nBE ADDED TO THE APPLICABLE FARE PER ANY\nPASSENGER.\nNOTE - TEXT BELOW NOT VALIDATED FOR AUTOPRICING.\nALL SURCHARGES MENTIONED ACCRUE TO 9W ONLY.\nORIGINATING BAH -\nIF THE FARE COMPONENT INCLUDES TRAVEL VIA DEL/BDQ/JAI/\nVNS\nTHEN THAT TRAVEL MUST BE ON\nONE OR MORE OF THE FOLLOWING\n9W FLIGHT 367 OPERATED BY 9W\n9W FLIGHT 373 OPERATED BY 9W\n9W FLIGHT 739 OPERATED BY 9W\n9W FLIGHT 740 OPERATED BY 9W\n9W FLIGHT 644 OPERATED BY 9W\n9W FLIGHT 762 OPERATED BY 9W\n9W FLIGHT 655 OPERATED BY 9W\n9W FLIGHT 795 OPERATED BY 9W\n9W FLIGHT 809 OPERATED BY 9W\n9W FLIGHT 824 OPERATED BY 9W\n9W FLIGHT 820 OPERATED BY 9W\n9W FLIGHT 333 OPERATED BY 9W\n9W FLIGHT 364 OPERATED BY 9W\n9W FLIGHT 857 OPERATED BY 9W\n9W FLIGHT 652 OPERATED BY 9W\n9W FLIGHT 856 OPERATED BY 9W\n9W FLIGHT 312 OPERATED BY 9W\n9W FLIGHT 366 OPERATED BY 9W\n9W FLIGHT 715 OPERATED BY 9W\n9W FLIGHT 139 OPERATED BY 9W\n9W FLIGHT 140 OPERATED BY 9W\n9W FLIGHT 785 OPERATED BY 9W\n9W FLIGHT 145 OPERATED BY 9W\n9W FLIGHT 146 OPERATED BY 9W\n9W FLIGHT 924 OPERATED BY 9W\n9W FLIGHT 375 OPERATED BY 9W\n9W FLIGHT 370 OPERATED BY 9W\nON DIRECT FLIGHTS.\nMISCELLANEOUS/OTHER SURCHARGE OF USD 55.00 WILL BE\nADDED TO THE APPLICABLE FARE PER ANY PASSENGER.\nNOTE - TEXT BELOW NOT VALIDATED FOR AUTOPRICING.\nALL SURCHARGES MENTIONED ACCRUE TO 9W ONLY.\nAND - FUEL SURCHARGE OF BHD 19.000 PER DIRECTION WILL\nBE ADDED TO THE APPLICABLE FARE PER ANY\nPASSENGER.\nNOTE - TEXT BELOW NOT VALIDATED FOR AUTOPRICING.\nALL SURCHARGES MENTIONED ACCRUE TO 9W ONLY.\nORIGINATING BAH -\nIF THE FARE COMPONENT INCLUDES TRAVEL VIA BHO/RPR/IMF/\nMAA\nTHEN THAT TRAVEL MUST BE ON\nONE OR MORE OF THE FOLLOWING\n9W FLIGHT 2121 OPERATED BY 9W\n9W FLIGHT 2843 OPERATED BY 9W\n9W FLIGHT 759 OPERATED BY 9W\n9W FLIGHT 799 OPERATED BY 9W\nON DIRECT FLIGHTS.\nMISCELLANEOUS/OTHER SURCHARGE OF USD 55.00 WILL BE\nADDED TO THE APPLICABLE FARE PER ANY PASSENGER.\nNOTE - TEXT BELOW NOT VALIDATED FOR AUTOPRICING.\nALL SURCHARGES MENTIONED ACCRUE TO 9W ONLY.\nAND - FUEL SURCHARGE OF BHD 19.000 PER DIRECTION WILL\nBE ADDED TO THE APPLICABLE FARE PER ANY\nPASSENGER.\nNOTE - TEXT BELOW NOT VALIDATED FOR AUTOPRICING.\nALL SURCHARGES MENTIONED ACCRUE TO 9W ONLY.\nORIGINATING INDIA -\nIF THE FARE COMPONENT INCLUDES TRAVEL VIA BOM/AMD/NAG/\nIDR\nTHEN THAT TRAVEL MUST BE ON\nONE OR MORE OF THE FOLLOWING\n9W FLIGHT 307 OPERATED BY 9W\n9W FLIGHT 309 OPERATED BY 9W\n9W FLIGHT 334 OPERATED BY 9W\n9W FLIGHT 345 OPERATED BY 9W\n9W FLIGHT 349 OPERATED BY 9W\n9W FLIGHT 355 OPERATED BY 9W\n9W FLIGHT 397 OPERATED BY 9W\n9W FLIGHT 411 OPERATED BY 9W\n9W FLIGHT 412 OPERATED BY 9W\n9W FLIGHT 416 OPERATED BY 9W\n9W FLIGHT 460 OPERATED BY 9W\n9W FLIGHT 461 OPERATED BY 9W\n9W FLIGHT 469 OPERATED BY 9W\n9W FLIGHT 489 OPERATED BY 9W\n9W FLIGHT 617 OPERATED BY 9W\n9W FLIGHT 618 OPERATED BY 9W\n9W FLIGHT 2385 OPERATED BY 9W\n9W FLIGHT 340 OPERATED BY 9W\n9W FLIGHT 414 OPERATED BY 9W\n9W FLIGHT 826 OPERATED BY 9W\n9W FLIGHT 472 OPERATED BY 9W\n9W FLIGHT 358 OPERATED BY 9W\n9W FLIGHT 762 OPERATED BY 9W\n9W FLIGHT 2349 OPERATED BY 9W\n9W FLIGHT 413 OPERATED BY 9W\n9W FLIGHT 311 OPERATED BY 9W\n9W FLIGHT 708 OPERATED BY 9W\n9W FLIGHT 705 OPERATED BY 9W\n9W FLIGHT 132 OPERATED BY 9W\n9W FLIGHT 131 OPERATED BY 9W\n9W FLIGHT 932 OPERATED BY 9W\n9W FLIGHT 719 OPERATED BY 9W\n9W FLIGHT 709 OPERATED BY 9W\n9W FLIGHT 147 OPERATED BY 9W\n9W FLIGHT 710 OPERATED BY 9W\n9W FLIGHT 148 OPERATED BY 9W\nON DIRECT FLIGHTS.\nMISCELLANEOUS/OTHER SURCHARGE OF USD 55.00 WILL BE\nADDED TO THE APPLICABLE FARE PER ANY PASSENGER.\nNOTE - TEXT BELOW NOT VALIDATED FOR AUTOPRICING.\nALL SURCHARGES MENTIONED ACCRUE TO 9W ONLY.\nAND - FUEL SURCHARGE OF USD 87.00 PER DIRECTION WILL\nBE ADDED TO THE APPLICABLE FARE PER ANY\nPASSENGER.\nNOTE - TEXT BELOW NOT VALIDATED FOR AUTOPRICING.\nALL SURCHARGES MENTIONED ACCRUE TO 9W ONLY.\nORIGINATING INDIA -\nIF THE FARE COMPONENT INCLUDES TRAVEL VIA BLR/GAU/PNQ/\nCCU\nTHEN THAT TRAVEL MUST BE ON\nONE OR MORE OF THE FOLLOWING\n9W FLIGHT 823 OPERATED BY 9W\n9W FLIGHT 824 OPERATED BY 9W\n9W FLIGHT 2479 OPERATED BY 9W\n9W FLIGHT 2480 OPERATED BY 9W\n9W FLIGHT 2491 OPERATED BY 9W\n9W FLIGHT 2492 OPERATED BY 9W\n9W FLIGHT 2736 OPERATED BY 9W\n9W FLIGHT 364 OPERATED BY 9W\n9W FLIGHT 363 OPERATED BY 9W\n9W FLIGHT 680 OPERATED BY 9W\n9W FLIGHT 491 OPERATED BY 9W\n9W FLIGHT 982 OPERATED BY 9W\n9W FLIGHT 981 OPERATED BY 9W\n9W FLIGHT 872 OPERATED BY 9W\n9W FLIGHT 853 OPERATED BY 9W\n9W FLIGHT 659 OPERATED BY 9W\n9W FLIGHT 921 OPERATED BY 9W\n9W FLIGHT 935 OPERATED BY 9W\n9W FLIGHT 854 OPERATED BY 9W\n9W FLIGHT 675 OPERATED BY 9W\n9W FLIGHT 669 OPERATED BY 9W\n9W FLIGHT 917 OPERATED BY 9W\n9W FLIGHT 605 OPERATED BY 9W\n9W FLIGHT 827 OPERATED BY 9W\n9W FLIGHT 802 OPERATED BY 9W\n9W FLIGHT 842 OPERATED BY 9W\n9W FLIGHT 660 OPERATED BY 9W\n9W FLIGHT 779 OPERATED BY 9W\n9W FLIGHT 606 OPERATED BY 9W\n9W FLIGHT 944 OPERATED BY 9W\n9W FLIGHT 918 OPERATED BY 9W\n9W FLIGHT 936 OPERATED BY 9W\nON DIRECT FLIGHTS.\nMISCELLANEOUS/OTHER SURCHARGE OF USD 55.00 WILL BE\nADDED TO THE APPLICABLE FARE PER ANY PASSENGER.\nNOTE - TEXT BELOW NOT VALIDATED FOR AUTOPRICING.\nALL SURCHARGES MENTIONED ACCRUE TO 9W ONLY.\nAND - FUEL SURCHARGE OF USD 87.00 PER DIRECTION WILL\nBE ADDED TO THE APPLICABLE FARE PER ANY\nPASSENGER.\nNOTE - TEXT BELOW NOT VALIDATED FOR AUTOPRICING.\nALL SURCHARGES MENTIONED ACCRUE TO 9W ONLY.\nORIGINATING INDIA -\nIF THE FARE COMPONENT INCLUDES TRAVEL VIA DEL/BDQ/JAI/\nVNS\nTHEN THAT TRAVEL MUST BE ON\nONE OR MORE OF THE FOLLOWING\n9W FLIGHT 367 OPERATED BY 9W\n9W FLIGHT 373 OPERATED BY 9W\n9W FLIGHT 739 OPERATED BY 9W\n9W FLIGHT 740 OPERATED BY 9W\n9W FLIGHT 644 OPERATED BY 9W\n9W FLIGHT 762 OPERATED BY 9W\n9W FLIGHT 655 OPERATED BY 9W\n9W FLIGHT 795 OPERATED BY 9W\n9W FLIGHT 809 OPERATED BY 9W\n9W FLIGHT 824 OPERATED BY 9W\n9W FLIGHT 820 OPERATED BY 9W\n9W FLIGHT 333 OPERATED BY 9W\n9W FLIGHT 364 OPERATED BY 9W\n9W FLIGHT 857 OPERATED BY 9W\n9W FLIGHT 652 OPERATED BY 9W\n9W FLIGHT 856 OPERATED BY 9W\n9W FLIGHT 312 OPERATED BY 9W\n9W FLIGHT 366 OPERATED BY 9W\n9W FLIGHT 715 OPERATED BY 9W\n9W FLIGHT 139 OPERATED BY 9W\n9W FLIGHT 140 OPERATED BY 9W\n9W FLIGHT 785 OPERATED BY 9W\n9W FLIGHT 145 OPERATED BY 9W\n9W FLIGHT 146 OPERATED BY 9W\n9W FLIGHT 924 OPERATED BY 9W\n9W FLIGHT 375 OPERATED BY 9W\n9W FLIGHT 370 OPERATED BY 9W\nON DIRECT FLIGHTS.\nMISCELLANEOUS/OTHER SURCHARGE OF USD 55.00 WILL BE\nADDED TO THE APPLICABLE FARE PER ANY PASSENGER.\nNOTE - TEXT BELOW NOT VALIDATED FOR AUTOPRICING.\nALL SURCHARGES MENTIONED ACCRUE TO 9W ONLY.\nAND - FUEL SURCHARGE OF USD 87.00 PER DIRECTION WILL\nBE ADDED TO THE APPLICABLE FARE PER ANY\nPASSENGER.\nNOTE - TEXT BELOW NOT VALIDATED FOR AUTOPRICING.\nALL SURCHARGES MENTIONED ACCRUE TO 9W ONLY.\nORIGINATING INDIA -\nIF THE FARE COMPONENT INCLUDES TRAVEL VIA BHO/RPR/IMF/\nMAA\nTHEN THAT TRAVEL MUST BE ON\nONE OR MORE OF THE FOLLOWING\n9W FLIGHT 2121 OPERATED BY 9W\n9W FLIGHT 2843 OPERATED BY 9W\n9W FLIGHT 759 OPERATED BY 9W\n9W FLIGHT 799 OPERATED BY 9W\nON DIRECT FLIGHTS.\nMISCELLANEOUS/OTHER SURCHARGE OF USD 55.00 WILL BE\nADDED TO THE APPLICABLE FARE PER ANY PASSENGER.\nNOTE - TEXT BELOW NOT VALIDATED FOR AUTOPRICING.\nALL SURCHARGES MENTIONED ACCRUE TO 9W ONLY.\nAND - FUEL SURCHARGE OF USD 87.00 PER DIRECTION WILL\nBE ADDED TO THE APPLICABLE FARE PER ANY\nPASSENGER.\nNOTE - TEXT BELOW NOT VALIDATED FOR AUTOPRICING.\nALL SURCHARGES MENTIONED ACCRUE TO 9W ONLY.\nORIGINATING BAH -\nFUEL SURCHARGE OF BHD 19.000 PER DIRECTION WILL BE\nADDED TO THE APPLICABLE FARE PER ANY PASSENGER.\nNOTE - TEXT BELOW NOT VALIDATED FOR AUTOPRICING.\nALL SURCHARGES MENTIONED ACCRUE TO 9W ONLY.\nAND - ORIGINATING INDIA -\nFUEL SURCHARGE OF USD 87.00 PER DIRECTION WILL BE\nADDED TO THE APPLICABLE FARE PER ANY PASSENGER.\nNOTE - TEXT BELOW NOT VALIDATED FOR AUTOPRICING.\nALL SURCHARGES MENTIONED ACCRUE TO 9W ONLY.",
        "headerText": "RULE-12"
      },
      {
        "content": "ACCOMPANIED TRAVEL NOT REQUIRED.",
        "headerText": "RULE-13"
      },
      {
        "content": "VALID FOR TRAVEL COMMENCING ON/AFTER 16JUL18.",
        "headerText": "RULE-14"
      },
      {
        "content": "FOOTNOTE RULE\nTICKETS MUST BE ISSUED ON/AFTER 26JUN18 AND ON/BEFORE\n30JUN18.\nFARE RULE\nTICKETS MAY ONLY BE SOLD IN AREA 1/AREA 2/AREA 3.\nGENERAL RULE - APPLY UNLESS OTHERWISE SPECIFIED\nTICKETS MUST BE ISSUED ON THE STOCK OF 9W.\nIF THE FARE COMPONENT IS ON\nONE OR MORE OF THE FOLLOWING\nANY EY FLIGHT OPERATED BY EY\nANY 9W FLIGHT OPERATED BY EY\nANY 9W FLIGHT OPERATED BY S2\nANY 9W FLIGHT OPERATED BY 9W.\nTICKETS MUST BE ISSUED ON THE STOCK OF 9W OR EY.\nTICKETS MUST BE ISSUED ON THE STOCK OF 9W OR HR AND\nMAY ONLY BE SOLD IN PAKISTAN/KAZAKHSTAN/JAMAICA/\nMACEDONIA/BRAZIL/MEXICO/NIGERIA/COLOMBIA/CHILE/PANAMA/\nMALTA/PERU/ARGENTINA/GHANA/CONGO BRAZZAVILLE/URUGUAY/\nMOROCCO/UKRAINE/TAJIKISTAN/AZERBAIJAN.",
        "headerText": "RULE-15"
      },
      {
        "content": "CHANGES\nANY TIME\nCHARGE USD 30.00.\nNOTE - TEXT BELOW NOT VALIDATED FOR AUTOPRICING.\nANY TIME CHANGES PERMITTED AT ABOVE CHARGE PLUS\nDIFFERENCE IN FARE IF ANY.\n.....\nAPPICABLE FOR DATE / FLIGHT/ ROUTING CHANGE.\n.....\nINCASE OF COMBINATIONS BETWEEN MULTIPLE FARES THE\nMOST RESTRICTIVE CONDITIONS WILL BE APPLICABLE\nFOR THE HIGHEST FEE OF ALL CHANGED FARE COMPONENT\nIN A PRICING UNIT.\n.....\nNO CHARGE FOR  INFANT WITHOUT A SEAT.\nADULT CHARGES APPLY FOR CHILD AND INFANT WITH\nSEAT.\nCHARGE USD 30.00 FOR NO-SHOW.\nNOTE - TEXT BELOW NOT VALIDATED FOR AUTOPRICING.\nIF A NO SHOW TICKET IS PROCESSED FOR ANY\nCHANGES/REFUND THEN THE PENALTIES FOR\nCHANGES/REFUND WILL BE APPLICABLE IN ADDITION TO\nTHE NO SHOW CHARGE\n.....\nINCASE OF COMBINATIONS BETWEEN MULTIPLE FARES THE\nMOST RESTRICTIVE CONDITIONS WILL BE APPLICABLE\nFOR THE ENTIRE PRICING UNIT.\nCANCELLATIONS\nANY TIME\nCHARGE USD 50.00 FOR CANCEL/REFUND.\nNOTE - TEXT BELOW NOT VALIDATED FOR AUTOPRICING.\n.....\nBASE FARE PLUS FUEL SURCHARGE OR\nCANCELLATON/REFUND FEES WHICHEVER IS LOWER WILL\nBE DEDUCTED WHEN PROCESSING REFUND.\nFOR NON-REFUNDABLE TICKETS BASIC PLUS FUEL\nSURCHARGE WILL BE FORFEITED IN CASE OF\nCANCELLATION OR REFUNDS. ONLY UNUTILIZED\nSTATUTORY TAXES WILL BE REFUNDED\n.....\nFOR REFUND -\nON SECTORS WHERE FIRST CLASS/PREMIERE SERVICE IS\nNOT OFFERED/AVAILABLE AT THE TIME OF TICKETING\nPASSENGERS MAY BE BOOKED IN THE NEXT LOWER CABIN.\nNO REFUND WILL BE PERMITTED FOR CLASS DIFFERENCE\nIN SUCH CASES.\n.....\nINCASE OF COMBINATIONS BETWEEN MULTIPLE FARES THE\nMOST RESTRICTIVE CONDITIONS WILL BE APPLICABLE\nFOR THE ENTIRE PRICING UNIT.\n.....\nPARTIALLY UTILISED- CHARGE APPLICABLE REFUND FEE\nPLUS THE APPLICABLE FARE FOR THE UTILIZED\nSECTOR.\n.....\nNO CHARGE FOR  INFANT WITHOUT A SEAT.\nADULT CHARGES APPLY FOR CHILD AND INFANT WITH\nSEAT.\nCHARGE USD 50.00 FOR NO-SHOW.\nNOTE - TEXT BELOW NOT VALIDATED FOR AUTOPRICING.\nIF A NO SHOW TICKET IS PROCESSED FOR ANY\nCHANGES/REFUND THEN THE PENALTIES FOR\nCHANGES/REFUND WILL BE APPLICABLE IN ADDITION TO\nTHE NO SHOW CHARGE.\n.....\nINCASE OF COMBINATIONS BETWEEN MULTIPLE FARES THE\nMOST RESTRICTIVE CONDITIONS WILL BE APPLICABLE\nFOR THE ENTIRE PRICING UNIT.\n.....\nBASE FARE PLUS FUEL SURCHARGE OR\nCANCELLATON/REFUND FEES WHICHEVER IS LOWER WILL\nBE DEDUCTED WHEN PROCESSING REFUND.\nFOR NON-REFUNDABLE TICKETS BASIC PLUS FUEL\nSURCHARGE WILL BE FORFEITED IN CASE OF\nCANCELLATION OR REFUNDS. ONLY UNUTILIZED\nSTATUTORY TAXES WILL BE REFUNDED\n.....\nGENERAL RULE - APPLY UNLESS OTHERWISE\nSPECIFIED\nNOTE - TEXT BELOW NOT VALIDATED FOR AUTOPRICING.\nONE FREE POSTPONEMENT IS PERMITTED TO INBOUND\nJOURNEY WHEN INBOUND IS REQUIRED OUTSIDE SYSTEM\nRANGE. IN SUCH CASES RESERVATION FOR INBOUND\nJOURNEY MUST BE MADE FOR LAST DATE IN SYSTEM\nRANGE AS ON DATE OF TICKET ISSUE. ANY OTHER\nCHANGES OR SUBSEQUENT CHANGES WILL BE SUBJECT TO\nCHARGES MENTIONED IN PENALTIES.\n.....\nFOR CHANGES BEFORE DEPARTURE HISTORICAL FARES\nMUST BE USED TO RE-PRICE THE TICKET PROVIDED\nCHANGES ARE WITHIN SAME RBD TRAVEL VALIDITY AND\nSEASONALITY.\n.....\nCHANGES TO RESERVATION IS NOT PERMITTED WITHIN\nONE HOUR OF FLIGHT DEPARTURE.ANY CHANGES MADE TO\nTHE RESERVATION WITHIN ONE HOUR OF FLIGHT\nDEPARTURE WILL BE TREATED AS NO SHOW AND WILL BE\nLIABLE FOR APPLICABLE PENALTIES.",
        "headerText": "RULE-16"
      },
      {
        "content": "NO HIP OR MILEAGE EXCEPTIONS APPLY.",
        "headerText": "RULE-17"
      },
      {
        "content": "THE ORIGINAL AND THE REISSUED TICKET MUST BE ANNOTATED\n- NON ENDO - IN THE ENDORSEMENT BOX.",
        "headerText": "RULE-18"
      },
      {
        "content": "IF THE FARE COMPONENT IS NOT ON\nONE OR MORE OF THE FOLLOWING\nANY FZ FLIGHT.\nCNN/ACCOMPANIED CHILD PSGR 2-11 - CHARGE 75 PERCENT\nOF THE FARE.\nTICKET DESIGNATOR - CH AND PERCENT APPLIED.\nMUST BE ACCOMPANIED ON ALL FLIGHTS IN THE SAME\nCOMPARTMENT BY ADULT PSGR 18 OR OLDER.\nOR - UNN/UNACCOMPANIED CHILD PSGR 5-12 - CHARGE 100\nPERCENT OF THE FARE.\nTICKET DESIGNATOR - CH AND PERCENT\nAPPLIED.\nNOTE - TEXT BELOW NOT VALIDATED FOR AUTOPRICING.\nFOR UNACCOMPANIED MINORS PLEASE CHECK FOR ANY\nFEES CHARGES WITH THE INTERLINE CARRIER.\nAPPLICABLE FEE CHARGE WILL BE COLLECTED BY THE\nRESPECTIVE OPERATING CARRIER AT THE TIME OF\nCHECK-IN.\nOR - INF/INFANT WITHOUT A SEAT PSGR UNDER 2 - CHARGE\n10 PERCENT OF THE FARE.\nTICKET DESIGNATOR - IN AND PERCENT\nAPPLIED.\nMUST BE ACCOMPANIED ON ALL FLIGHTS IN THE SAME\nCOMPARTMENT BY ADULT PSGR 18 OR OLDER.\nOR - INS/INFANT WITH A SEAT PSGR UNDER 2 - CHARGE 75\nPERCENT OF THE FARE.\nTICKET DESIGNATOR - CH AND PERCENT\nAPPLIED.\nMUST BE ACCOMPANIED ON ALL FLIGHTS IN THE SAME\nCOMPARTMENT BY ADULT PSGR 18 OR OLDER.\nOTHERWISE\nCNN/ACCOMPANIED CHILD PSGR 2-11 - CHARGE 100 PERCENT\nOF THE FARE.\nTICKET DESIGNATOR - CH AND PERCENT APPLIED.\nMUST BE ACCOMPANIED ON ALL FLIGHTS IN THE SAME\nCOMPARTMENT BY ADULT PSGR 18 OR OLDER.\nOR - UNN/UNACCOMPANIED CHILD PSGR 5-12 - CHARGE 100\nPERCENT OF THE FARE.\nTICKET DESIGNATOR - CH AND PERCENT\nAPPLIED.\nNOTE - TEXT BELOW NOT VALIDATED FOR AUTOPRICING.\nFOR UNACCOMPANIED MINORS PLEASE CHECK FOR ANY\nFEES CHARGES WITH THE INTERLINE CARRIER.\nAPPLICABLE FEE CHARGE WILL BE COLLECTED BY THE\nRESPECTIVE OPERATING CARRIER AT THE TIME OF\nCHECK-IN.\nOR - INF/INFANT WITHOUT A SEAT PSGR UNDER 2 - CHARGE\n10 PERCENT OF THE FARE.\nTICKET DESIGNATOR - IN AND PERCENT\nAPPLIED.\nMUST BE ACCOMPANIED ON ALL FLIGHTS IN THE SAME\nCOMPARTMENT BY ADULT PSGR 18 OR OLDER.\nOR - INS/INFANT WITH A SEAT PSGR UNDER 2 - CHARGE 100\nPERCENT OF THE FARE.\nTICKET DESIGNATOR - CH AND PERCENT\nAPPLIED.\nMUST BE ACCOMPANIED ON ALL FLIGHTS IN THE SAME\nCOMPARTMENT BY ADULT PSGR 18 OR OLDER.",
        "headerText": "RULE-19"
      },
      {
        "content": "NO DISCOUNTS FOR TOUR CONDUCTORS.",
        "headerText": "RULE-20"
      },
      {
        "content": "NO DISCOUNTS FOR SALE AGENTS.",
        "headerText": "RULE-21"
      },
      {
        "content": "NO DISCOUNTS FOR OTHERS.",
        "headerText": "RULE-22"
      },
      {
        "content": "NO PROVISIONS APPLY.",
        "headerText": "RULE-23"
      },
      {
        "content": "NOT APPLICABLE.",
        "headerText": "RULE-25"
      },
      {
        "content": "NO GROUP PROVISIONS APPLY.",
        "headerText": "RULE-26"
      },
      {
        "content": "NO TOUR PROVISIONS APPLY.",
        "headerText": "RULE-27"
      },
      {
        "content": "NO VISIT ANOTHER COUNTRY PROVISIONS APPLY.",
        "headerText": "RULE-28"
      },
      {
        "content": "NO DEPOSIT PROVISIONS APPLY.",
        "headerText": "RULE-29"
      },
      {
        "content": "ENTER RD*31 OR RDLINE NUM*31 FOR VOLUNTARY CHGS.",
        "headerText": "RULE-31"
      },
      {
        "content": "CHECK CATEGORY 16 OR CONTACT CARRIER FOR DETAILS.",
        "headerText": "RULE-33"
      },
      {
        "content": "NOT APPLICABLE.",
        "headerText": "RULE-35"
      },
      {
        "content": "NOT A CONSTRUCTED FARE",
        "headerText": "IC"
      }
    ],
    "agncyInfos": null,
    "canclReason": null,
    "canclReqBy": null,
    "canclDate": null,
    "subAgentInfo": null,
    "cnvrsnRate": null,
    "agncCnvrsnRate": null,
    "cnvrtdCurrencyCode": null,
    "otherRmks": null,
    "freqFlyer": null,
    "fareConstructTxt": null,
    "vendorInfoLst": null,
    "totBaggAmt": 0.00,
    "serviceOrderType": "FLT",
    "totalFare": 49.00,
    "totalTax": 37.00,
    "totPassengerFare": 12.00,
    "origin": "BAH",
    "destination": "MAA",
    "deptDate": "28-09-2018",
    "arrDate": "29-09-2018",
    "agentInfoBean": {
      "agentId": 162,
      "agentName": "AGENT",
      "agentCode": "AGNT990",
      "agentPhoneNo": "32434432",
      "agentType": null,
      "parentAgent": null,
      "agentEmail": "raghavendram@convergentechnologies.com",
      "creditInfoBean": {
        "creditUtilized": null,
        "creditBalance": null,
        "companyCl": null,
        "allocationCl": null,
        "availedCl": null,
        "thresholdLimit": null,
        "prepaidAmount": null,
        "tempCreditAmount": null,
        "creditApplyType": null,
        "setupFlag": false
      }
    },
    "rejectRemarks": null,
    "rejectStatus": null,
    "displayOrigin": "Bahrain ",
    "displayDestination": "Chennai ",
    "ticketedOn": "27-Jun-2018",
    "ticketedBy": 390,
    "voidedOn": null,
    "voidedBy": null,
    "platingAirlineName": "Jet Airways",
    "platingAirlinePNR": "MMTRLB",
    "ticketInit": false,
    "insuranceStatus": null,
    "totInsuranceAmt": 0.00,
    "otherCharges": 0,
    "paymentType": null,
    "cardCharges": 0.00,
    "voidCharages": null,
    "refunded": false,
    "externalBooking": false,
    "updatedGrandTot": null,
    "serviceChrgIds": null,
    "prvdrName": "SABRE",
    "totMealAmt": 0.00,
    "totSeatAmt": 0.00,
    "paymentRefNo": null,
    "insuranceDtls": null
  }
}