[

    {
        "title": "Star Rating",
        "filters": [{
            "title": "5 Star",
            "price": "1,350"
        }, {
            "title": "4 Star",
            "price": "1,250"
        }, {
            "title": "3 Star",
            "price": "355",
            "cheapest": true
        }]
  }, {
        "title": "Facilities",
        "filters": [{
            "title": "Air Conditioning",
            "price": "355",
            "cheapest": true
        }, {
            "title": "Babysitting / Childcare",
            "price": "1,602"
        }, {
            "title": "Bar",
            "price": "1,250"
        }, {
            "title": "Golf",
            "price": "2,492"
        }, {
            "title": "Gym",
            "price": "1,250"
        }]
  }, {
        "title": "Price Range",
        "sliders": {
            "from": 350,
            "to": 4140
        }
  }, {
        "title": "Hotel Name",
        "searchBox": true
  }]
