[{
    "fromFlight": {
        "date": "Sat 26 May 2018",
        "flightLogo": "ai.png",
        "departureCityCode": "DXB",
        "departureCityName": "Dubai",
        "departureTime": "23:30",
        "arrivalTime": "05:00",
        "destinationCityCode": "MAA",
        "destinationCity": "Chennai",
        "stops": "Direct",
        "days": "1",
        "duration": "04h 00m"
    },
    "returnFlight": {
        "date": "Thu 31 May 2018",
        "flightLogo": "ai.png",
        "departureCityCode": "MAA",
        "departureCityName": "Chennai",
        "departureTime": "19:05",
        "arrivalTime": "21:30",
        "destinationCityCode": "DXB",
        "destinationCity": "Dubai",
        "stops": "Direct",
        "duration": "03h 55m"
    },
    "totalFare": "1,972.00"
}]
