{
    "compilerOptions": {
        "experimentalDecorators": true,
        "baseUrl": ".",
        "paths": {
            "c/myFirstWebComponent": [
                "myFirstWebComponent/myFirstWebComponent.js"
            ],
            "c/tempNewProvider": [
                "tempNewProvider/tempNewProvider.js"
            ]
        }
    },
    "include": [
        "**/*",
        "../../../../.sfdx/typings/lwc/**/*.d.ts"
    ],
    "typeAcquisition": {
        "include": [
            "jest"
        ]
    }
}
