-------------------------------------------------------------------------------
Test set: JiveEmailValidator
-------------------------------------------------------------------------------
Tests run: 2, Failures: 0, Errors: 0, Skipped: 0, Time elapsed: 24.263 sec
