{
    "logs":{
       "logs_collected":{
          "files":{
             "collect_list":[
                {
                   "file_path":"/home/ec2-user/springboot/logs/spring-boot-logger.log",
                   "log_group_name":"spring-boot-logging",
                   "log_stream_name":"spring-boot-logger-{instance_id}.log",
                   "timestamp_format":"%Y-%m-%d %H:%M:%S.%f",
                   "multi_line_start_pattern":"{timestamp_format}"
                }
             ]
          }
       }
    },
    "metrics":{
       "namespace":"SpringBootMetrics/dev",
       "append_dimensions":{
          "AutoScalingGroupName":"${aws:AutoScalingGroupName}",
          "InstanceId":"${aws:InstanceId}"
       },
       "aggregation_dimensions":[
          [
             "AutoScalingGroupName"
          ]
       ],
       "metrics_collected":{
          "mem":{
             "measurement":[
                {
                   "name":"mem_used_percent",
                   "rename":"MemoryUtilization",
                   "unit":"Percent"
                }
             ],
             "metrics_collection_interval":60
          },
          "swap":{
             "measurement":[
                {
                   "name":"swap_used_percent",
                   "rename":"SwapMemoryUtilization",
                   "unit":"Percent"
                }
             ],
             "metrics_collection_interval":60
          },
          "disk":{
             "resources":[
                "/"
             ],
             "measurement":[
                {
                   "name":"used_percent",
                   "rename":"DiskUsed",
                   "unit":"Percent"
                },
                {
                   "name":"free",
                   "rename":"DiskFree",
                   "unit":"Percent"
                }
             ],
             "drop_device":true,
             "metrics_collection_interval":60
          }
       }
    }
 }