UPDATE `users` SET `CalculatedDigits`=0 WHERE 1;
UPDATE `users` SET `CalculatedDigits`=50 WHERE `UID`='sZLxyI2CK4QCxjG3emTPpIBhdj42';

TRUNCATE `povr01_pi`.`queue`;
TRUNCATE `povr01_pi`.`pi`;

INSERT INTO `pi`(`Digits`) VALUES ('243F6A8885A308D313198A2E03707344A4093822299F31D008');