<?xml version="1.0" encoding="utf-8"?>
<!-- Generator: Adobe Illustrator 23.0.1, SVG Export Plug-In . SVG Version: 6.00 Build 0)  -->
<svg version="1.1"
	 id="svg3895" xmlns:cc="http://creativecommons.org/ns#" xmlns:dc="http://purl.org/dc/elements/1.1/" xmlns:inkscape="http://www.inkscape.org/namespaces/inkscape" xmlns:rdf="http://www.w3.org/1999/02/22-rdf-syntax-ns#" xmlns:sodipodi="http://sodipodi.sourceforge.net/DTD/sodipodi-0.dtd" xmlns:svg="http://www.w3.org/2000/svg"
	 xmlns="http://www.w3.org/2000/svg" xmlns:xlink="http://www.w3.org/1999/xlink" x="0px" y="0px" viewBox="0 0 209.6 61.6"
	 style="enable-background:new 0 0 209.6 61.6;" xml:space="preserve">
<style type="text/css">
	.st0{fill:#fff;}
	.st1{fill:#fff;}
</style>
<sodipodi:namedview  bordercolor="#666666" borderopacity="1.0" fit-margin-bottom="0" fit-margin-left="0" fit-margin-right="0" fit-margin-top="0" id="base" inkscape:current-layer="layer1" inkscape:cx="452.33962" inkscape:cy="263.1401" inkscape:document-units="px" inkscape:pageopacity="0.0" inkscape:pageshadow="2" inkscape:window-height="801" inkscape:window-maximized="1" inkscape:window-width="1536" inkscape:window-x="-8" inkscape:window-y="-8" inkscape:zoom="0.49497475" pagecolor="#ffffff" showgrid="false">
	</sodipodi:namedview>
<g id="layer1" transform="translate(-66.128595,-615.18282)" inkscape:groupmode="layer" inkscape:label="Layer 1">
	<g id="g6230" transform="translate(6.0609153,28.284271)">
		<g id="g3854" transform="matrix(1.25,0,0,-1.25,133.35243,633.27005)">
			<path id="path3856" inkscape:connector-curvature="0" class="st0" d="M-22.4,16.6c-10.8,0-11.9-13.4-20.1-13.4
				c-3.2,0-5.3,2.2-5.3,5.2c0,2.9,2.1,5.1,5.2,5.1c2,0,3.7-1,5.2-2.3l2,2.3c0,0,0,0,0,0l6.8,7.8h-4.1l4.5,7.5h-5.5l-2.4-9.2l3.2,0.1
				l-3-5.7c-2,1.8-4.3,2.6-6.9,2.6c-5.1,0-8.6-3.7-8.6-8.2c0-4.6,3.5-8.3,8.8-8.3c10.8,0,12.1,13.4,20,13.4c3.3,0,5.4-2.2,5.4-5.2
				c0-2.9-2.1-5.1-5.2-5.1c-2,0-3.7,1-5.2,2.3l-2-2.3c2-2.1,4.6-3.1,7.4-3.1c5.1,0,8.6,3.7,8.6,8.2C-13.6,12.9-17.1,16.6-22.4,16.6"
				/>
		</g>
		<g id="g3858" transform="matrix(1.25,0,0,-1.25,174.26193,658.3493)">
			<path id="path3860" inkscape:connector-curvature="0" class="st1" d="M-28.9,20.6h-1.7l-8,15.7h2.8l6.1-12.1h0l5.8,12.1h2.7
				L-28.9,20.6z"/>
		</g>
		<g id="g3862" transform="matrix(1.25,0,0,-1.25,190.82193,658.24067)">
			<path id="path3864" inkscape:connector-curvature="0" class="st1" d="M-31.6,20.6v15.6h11.1V34h-8.6v-4.3h6.7v-2.2h-6.7v-4.5h8.8
				v-2.2H-31.6z"/>
		</g>
		<g id="g3866" transform="matrix(1.25,0,0,-1.25,227.2758,658.6093)">
			<path id="path3868" inkscape:connector-curvature="0" class="st1" d="M-37.4,20.7c-6,0-9.3,3.1-9.3,7.8c0,4.7,3.5,8.1,9.2,8.1
				c2.2,0,4.5-0.5,6.6-1.4l-0.8-2.1c-1.8,0.8-3.8,1.2-5.7,1.2c-4.3,0-6.8-2.5-6.8-5.7c0-3.4,2.4-5.7,6.8-5.7c1.4,0,2.9,0.2,4.2,0.6
				v3.6h-5.3v2.2h7.8v-7.4C-32.2,21.3-34.9,20.7-37.4,20.7"/>
		</g>
		<g id="g3870" transform="matrix(1.25,0,0,-1.25,257.01455,637.28117)">
			<path id="path3872" inkscape:connector-curvature="0" class="st1" d="M-42.2,17.3c-3.8,0-6-2.4-6-5.7c0-3.3,2.2-5.7,6-5.7
				c3.8,0,6,2.4,6,5.7C-36.1,14.8-38.3,17.3-42.2,17.3 M-42.2,3.6c-5,0-8.7,3.1-8.7,7.9c0,4.8,3.6,8,8.7,8c5.1,0,8.7-3.2,8.7-8
				C-33.5,6.7-37.2,3.6-42.2,3.6"/>
		</g>
		<g id="g3874" transform="matrix(1.25,0,0,-1.25,287.41005,658.3493)">
			<path id="path3876" inkscape:connector-curvature="0" class="st1" d="M-47,20.6h-1.7l-8,15.7h2.8l6.1-12.1h0l5.8,12.1h2.7
				L-47,20.6z"/>
		</g>
		<g id="g3878" transform="matrix(1.25,0,0,-1.25,311.43843,639.27705)">
			<path id="path3880" inkscape:connector-curvature="0" class="st1" d="M-50.9,17.6L-50.9,17.6l-2.6-5.5h5.4L-50.9,17.6z
				 M-44.8,5.4L-47,9.9h-7.6l-2.1-4.4h-2.8l7.7,15.7h1.8l8-15.7C-42,5.4-44.8,5.4-44.8,5.4z"/>
		</g>
	</g>
</g>
</svg>
