\relax 
\providecommand{\transparent@use}[1]{}
\select@language{croatian}
\@writefile{toc}{\select@language{croatian}}
\@writefile{lof}{\select@language{croatian}}
\@writefile{lot}{\select@language{croatian}}
\@writefile{toc}{\contentsline {chapter}{\numberline {1}Uvod}{1}}
\@writefile{lof}{\addvspace {10\p@ }}
\@writefile{lot}{\addvspace {10\p@ }}
\@writefile{toc}{\contentsline {chapter}{\numberline {2}Konvolucijska neuronska mre\IeC {\v z}a}{2}}
\@writefile{lof}{\addvspace {10\p@ }}
\@writefile{lot}{\addvspace {10\p@ }}
\@writefile{toc}{\contentsline {section}{\numberline {2.1}Motivacija}{2}}
\newlabel{eq:1}{{2.1}{2}}
\newlabel{eq:2}{{2.2}{2}}
\newlabel{eq:grad-desc}{{2.3}{3}}
\@writefile{lof}{\contentsline {figure}{\numberline {2.1}{\ignorespaces Linearna regresija\relax }}{3}}
\providecommand*\caption@xref[2]{\@setref\relax\@undefined{#1}}
\newlabel{figure:lin-reg}{{2.1}{3}}
\@writefile{lof}{\contentsline {figure}{\numberline {2.2}{\ignorespaces Jednostavna FFNN mre\IeC {\v z}a\relax }}{3}}
\newlabel{figure:simple-net}{{2.2}{3}}
\@writefile{toc}{\contentsline {section}{\numberline {2.2}Slojevi konvolucijske neuronske mre\IeC {\v z}e}{4}}
\@writefile{toc}{\contentsline {subsection}{\numberline {2.2.1}Konvolucijski sloj}{4}}
\newlabel{sec:conv}{{2.2.1}{4}}
\newlabel{eq:conv1}{{2.4}{4}}
\newlabel{eq:conv2}{{2.5}{4}}
\@writefile{lot}{\contentsline {table}{\numberline {2.1}{\ignorespaces Ulazni volumen\relax }}{5}}
\newlabel{table:in-vol}{{2.1}{5}}
\@writefile{lot}{\contentsline {table}{\numberline {2.2}{\ignorespaces Kernel veli\IeC {\v c}ine 3x3\relax }}{5}}
\newlabel{table:kernel}{{2.2}{5}}
\@writefile{lof}{\contentsline {figure}{\numberline {2.3}{\ignorespaces Dimenzija izlaza. Korak konvolucije(s), Obrub(p).\relax }}{5}}
\newlabel{conv-dim}{{2.3}{5}}
\@writefile{lof}{\contentsline {figure}{\numberline {2.4}{\ignorespaces Djelovanje konvolucije na sliku\relax }}{6}}
\@writefile{toc}{\contentsline {subsection}{\numberline {2.2.2}Pooling sloj}{7}}
\newlabel{eq:pwdim}{{2.6}{7}}
\newlabel{eq:phdim}{{2.7}{7}}
\@writefile{toc}{\contentsline {subsection}{\numberline {2.2.3}Potpuno povezani sloj}{8}}
\@writefile{toc}{\contentsline {section}{\numberline {2.3}Aktivacijska funkcija}{9}}
\@writefile{lof}{\contentsline {figure}{\numberline {2.5}{\ignorespaces Funkcija $\sigma (x)$.\relax }}{9}}
\citation{Krizhevski}
\@writefile{lof}{\contentsline {figure}{\numberline {2.6}{\ignorespaces Funkcija tangens hiperbolni tanh(x).\relax }}{10}}
\@writefile{toc}{\contentsline {subsection}{\numberline {2.3.1}ReLU}{10}}
\@writefile{lof}{\contentsline {figure}{\numberline {2.7}{\ignorespaces ReLU(x) = max(0,x).\relax }}{11}}
\@writefile{toc}{\contentsline {subsection}{\numberline {2.3.2}SoftMax}{11}}
\newlabel{eq:softmax}{{2.10}{11}}
\newlabel{sec:act-fun}{{2.3.2}{11}}
\@writefile{toc}{\contentsline {section}{\numberline {2.4}Kriterij pogre\IeC {\v s}ke}{12}}
\@writefile{toc}{\contentsline {subsection}{\numberline {2.4.1}Srednji kvadrat pogre\IeC {\v s}ke (MSE)}{13}}
\@writefile{toc}{\contentsline {subsection}{\numberline {2.4.2}Cross-Entropy}{13}}
\@writefile{toc}{\contentsline {section}{\numberline {2.5}Algoritmi optimizacije }{15}}
\@writefile{toc}{\contentsline {subsection}{\numberline {2.5.1}SGD}{15}}
\newlabel{eq:sgd}{{2.19}{15}}
\newlabel{sec:cost-fun}{{2.5.1}{16}}
\@writefile{toc}{\contentsline {section}{\numberline {2.6}Treniranje mre\IeC {\v z}e}{16}}
\@writefile{toc}{\contentsline {chapter}{\numberline {3}Pregled prakti\IeC {\v c}nog ostvarenja duboke CNN mre\IeC {\v z}e}{17}}
\@writefile{lof}{\addvspace {10\p@ }}
\@writefile{lot}{\addvspace {10\p@ }}
\@writefile{toc}{\contentsline {subsection}{\numberline {3.0.1}Baza slika}{17}}
\@writefile{toc}{\contentsline {subsection}{\numberline {3.0.2}YUV pretvorba}{17}}
\@writefile{lof}{\contentsline {figure}{\numberline {3.1}{\ignorespaces Razli\IeC {\v c}ite razine okluzije i poze skupa lica prije obrade.\relax }}{18}}
\newlabel{fig:faces-1}{{3.1}{18}}
\@writefile{lof}{\contentsline {figure}{\numberline {3.2}{\ignorespaces Y i U komponenta. V komponenta nije prikazana zbog slabog kontrasta.\relax }}{18}}
\@writefile{toc}{\contentsline {subsection}{\numberline {3.0.3}Normalizacija}{19}}
\@writefile{lof}{\contentsline {figure}{\numberline {3.3}{\ignorespaces Globalna normalizacija.\relax }}{19}}
\newlabel{eq:global-norm}{{3.3}{19}}
\citation{LeCun}
\@writefile{lof}{\contentsline {figure}{\numberline {3.4}{\ignorespaces Original i slika na koju je primjenjena globalna i lokalna normalizacija.\relax }}{21}}
\newlabel{img-gauss}{{3.4}{21}}
\@writefile{toc}{\contentsline {subsection}{\numberline {3.0.4}Arhitektura mre\IeC {\v z}e}{22}}
\@writefile{lof}{\contentsline {figure}{\numberline {3.5}{\ignorespaces Skica mre\IeC {\v z}e\relax }}{22}}
\newlabel{netnet}{{3.5}{22}}
\@writefile{toc}{\contentsline {subsection}{\numberline {3.0.5}Treniranje i testiranje}{23}}
\@writefile{lof}{\contentsline {figure}{\numberline {3.6}{\ignorespaces Ispravnost klasifikacije uz $\eta = 0.01$ nad setom za u\IeC {\v c}enje.\relax }}{24}}
\newlabel{fig:classfig-et2}{{3.6}{24}}
\@writefile{lof}{\contentsline {figure}{\numberline {3.7}{\ignorespaces Ispravnost klasifikacije uz $\eta = 0.01$ nad setom za ispitivanje.\relax }}{24}}
\newlabel{fig:classfig-test}{{3.7}{24}}
\@writefile{lof}{\contentsline {figure}{\numberline {3.8}{\ignorespaces Ispravnost klasifikacije uz $\eta = 0.001$ nad setom za u\IeC {\v c}enje.\relax }}{25}}
\newlabel{fig:classfig-et3}{{3.8}{25}}
\@writefile{lof}{\contentsline {figure}{\numberline {3.9}{\ignorespaces Ispravnost klasifikacije uz $\eta = 0.00001$ nad setom za u\IeC {\v c}enje.\relax }}{25}}
\newlabel{fig:classfig-et5}{{3.9}{25}}
\@writefile{toc}{\contentsline {subsection}{\numberline {3.0.6}Rezultati}{26}}
\newlabel{fig:det-1}{{\caption@xref {fig:det-1}{ on input line 721}}{27}}
\@writefile{lof}{\contentsline {figure}{\numberline {3.10}{\ignorespaces Prozori detekcije.\relax }}{27}}
\newlabel{fig:det-2}{{3.10}{27}}
\@writefile{lof}{\contentsline {figure}{\numberline {3.11}{\ignorespaces Detekcija pojedina\IeC {\v c}nih lica.\relax }}{27}}
\newlabel{fig:det-3}{{3.11}{27}}
\@writefile{lof}{\contentsline {figure}{\numberline {3.12}{\ignorespaces Interpolacija i uklanjanje suvi\IeC {\v s}nih prozora.\relax }}{27}}
\@writefile{lof}{\contentsline {figure}{\numberline {3.13}{\ignorespaces Tablica 1 prikazuje broj neurona po slojevima, a Tablica 2 udio u operacijama.\relax }}{28}}
\citation{*}
\bibdata{literatura}
\@writefile{toc}{\contentsline {chapter}{\numberline {4}Zaklju\IeC {\v c}ak}{31}}
\@writefile{lof}{\addvspace {10\p@ }}
\@writefile{lot}{\addvspace {10\p@ }}
\bibcite{stanford-sgd}{{1}{}{{sta}}{{}}}
\bibcite{Krizhevski}{{2}{2012}{{A.~Krizhevsky}}{{}}}
\bibcite{Goodfellow-et-al-2016}{{3}{2016}{{Goodfellow et~al.}}{{Goodfellow, Bengio, i Courville}}}
\bibcite{convback}{{4}{2016}{{Gwardys}}{{}}}
\bibcite{LeCun}{{5}{2009}{{Jarrett i LeCun}}{{}}}
\bibcite{div-norm}{{6}{2008}{{Lyu i Simoncelli.}}{{}}}
\bibstyle{fer}
\@writefile{toc}{\contentsline {chapter}{Literatura}{32}}
