^C:\PROJECTS\IRG\BIBLIOTEKE\FREEGLUT-2.8.1\PROGS\DEMOS\FRACTALS_RANDOM\FRACTALS_RANDOM.C
C:\PROJECTS\IRG\BIBLIOTEKE\FREEGLUT-2.8.1\VISUALSTUDIO\2012\FRACTALS_RANDOM\DEBUG\WIN32_V120\VC120.PDB
C:\PROJECTS\IRG\BIBLIOTEKE\FREEGLUT-2.8.1\VISUALSTUDIO\2012\FRACTALS_RANDOM\DEBUG\WIN32_V120\VC120.IDB
C:\PROJECTS\IRG\BIBLIOTEKE\FREEGLUT-2.8.1\VISUALSTUDIO\2012\FRACTALS_RANDOM\DEBUG\WIN32_V120\FRACTALS_RANDOM.OBJ
