^C:\PROJECTS\IRG\RAG_LABOSI\RG2018\PROJEKT\DEBUG\MAINTEX.OBJ|C:\PROJECTS\IRG\RAG_LABOSI\RG2018\PROJEKT\DEBUG\SHADER.OBJ|C:\PROJECTS\IRG\RAG_LABOSI\RG2018\PROJEKT\DEBUG\UTIL.OBJ
C:\PROJECTS\IRG\RAG_LABOSI\RG2018\LIB\SOIL.LIB
D:\WINDOWS KITS\10\LIB\10.0.17134.0\UM\X86\OPENGL32.LIB
C:\PROJECTS\IRG\RAG_LABOSI\RG2018\LIB\FREEGLUT-2.8.1\LIB\X86\DEBUG\FREEGLUT.LIB
C:\PROJECTS\IRG\RAG_LABOSI\RG2018\LIB\GLEW-1.13.0\LIB\RELEASE\WIN32\GLEW32.LIB
D:\WINDOWS KITS\10\LIB\10.0.17134.0\UM\X86\KERNEL32.LIB
D:\WINDOWS KITS\10\LIB\10.0.17134.0\UM\X86\USER32.LIB
D:\WINDOWS KITS\10\LIB\10.0.17134.0\UM\X86\GDI32.LIB
D:\WINDOWS KITS\10\LIB\10.0.17134.0\UM\X86\WINSPOOL.LIB
D:\WINDOWS KITS\10\LIB\10.0.17134.0\UM\X86\COMDLG32.LIB
D:\WINDOWS KITS\10\LIB\10.0.17134.0\UM\X86\ADVAPI32.LIB
D:\WINDOWS KITS\10\LIB\10.0.17134.0\UM\X86\SHELL32.LIB
D:\WINDOWS KITS\10\LIB\10.0.17134.0\UM\X86\OLE32.LIB
D:\WINDOWS KITS\10\LIB\10.0.17134.0\UM\X86\OLEAUT32.LIB
D:\WINDOWS KITS\10\LIB\10.0.17134.0\UM\X86\UUID.LIB
D:\WINDOWS KITS\10\LIB\10.0.17134.0\UM\X86\ODBC32.LIB
D:\WINDOWS KITS\10\LIB\10.0.17134.0\UM\X86\ODBCCP32.LIB
C:\PROJECTS\IRG\RAG_LABOSI\RG2018\PROJEKT\DEBUG\MAINTEX.OBJ
C:\PROJECTS\IRG\RAG_LABOSI\RG2018\PROJEKT\DEBUG\SHADER.OBJ
C:\PROJECTS\IRG\RAG_LABOSI\RG2018\PROJEKT\DEBUG\UTIL.OBJ
C:\WINDOWS\SYSTEM32\TZRES.DLL
C:\WINDOWS\GLOBALIZATION\SORTING\SORTDEFAULT.NLS
D:\MICROSOFT\VISUALSTUDIO\VC\TOOLS\MSVC\14.15.26726\LIB\X86\MSVCPRTD.LIB
D:\WINDOWS KITS\10\LIB\10.0.17134.0\UM\X86\GLU32.LIB
D:\WINDOWS KITS\10\LIB\10.0.17134.0\UM\X86\WINMM.LIB
D:\MICROSOFT\VISUALSTUDIO\VC\TOOLS\MSVC\14.15.26726\LIB\X86\MSVCRTD.LIB
D:\MICROSOFT\VISUALSTUDIO\VC\TOOLS\MSVC\14.15.26726\LIB\X86\OLDNAMES.LIB
D:\MICROSOFT\VISUALSTUDIO\VC\TOOLS\MSVC\14.15.26726\LIB\X86\VCRUNTIMED.LIB
D:\WINDOWS KITS\10\LIB\10.0.17134.0\UCRT\X86\UCRTD.LIB
D:\MICROSOFT\VISUALSTUDIO\VC\TOOLS\MSVC\14.15.26726\BIN\HOSTX86\X86\LINK.EXE
D:\WINDOWS KITS\10\BIN\10.0.17134.0\X86\RC.EXE
D:\MICROSOFT\VISUALSTUDIO\VC\TOOLS\MSVC\14.15.26726\BIN\HOSTX86\X86\CVTRES.EXE
D:\MICROSOFT\VISUALSTUDIO\VC\TOOLS\MSVC\14.15.26726\BIN\HOSTX86\X86\MSPDBSRV.EXE
