^C:\PROJECTS\IRG\RAG_LABOSI\RG2018\TEXTURETEST\DEBUG\MAINTEX.OBJ
C:\PROJECTS\IRG\RAG_LABOSI\RG2018\DEBUG\TEXTURETEST.EXE
C:\PROJECTS\IRG\RAG_LABOSI\RG2018\DEBUG\TEXTURETEST.ILK
C:\PROJECTS\IRG\RAG_LABOSI\RG2018\DEBUG\TEXTURETEST.PDB
