^C:\PROJECTS\IRG\BIBLIOTEKE\FREEGLUT-2.8.1\SRC\FREEGLUT_CALLBACKS.C|C:\PROJECTS\IRG\BIBLIOTEKE\FREEGLUT-2.8.1\SRC\FREEGLUT_CURSOR.C|C:\PROJECTS\IRG\BIBLIOTEKE\FREEGLUT-2.8.1\SRC\FREEGLUT_DISPLAY.C|C:\PROJECTS\IRG\BIBLIOTEKE\FREEGLUT-2.8.1\SRC\FREEGLUT_EXT.C|C:\PROJECTS\IRG\BIBLIOTEKE\FREEGLUT-2.8.1\SRC\FREEGLUT_FONT.C|C:\PROJECTS\IRG\BIBLIOTEKE\FREEGLUT-2.8.1\SRC\FREEGLUT_FONT_DATA.C|C:\PROJECTS\IRG\BIBLIOTEKE\FREEGLUT-2.8.1\SRC\FREEGLUT_GAMEMODE.C|C:\PROJECTS\IRG\BIBLIOTEKE\FREEGLUT-2.8.1\SRC\FREEGLUT_GEOMETRY.C|C:\PROJECTS\IRG\BIBLIOTEKE\FREEGLUT-2.8.1\SRC\FREEGLUT_GLUTFONT_DEFINITIONS.C|C:\PROJECTS\IRG\BIBLIOTEKE\FREEGLUT-2.8.1\SRC\FREEGLUT_INIT.C|C:\PROJECTS\IRG\BIBLIOTEKE\FREEGLUT-2.8.1\SRC\FREEGLUT_INPUT_DEVICES.C|C:\PROJECTS\IRG\BIBLIOTEKE\FREEGLUT-2.8.1\SRC\FREEGLUT_JOYSTICK.C|C:\PROJECTS\IRG\BIBLIOTEKE\FREEGLUT-2.8.1\SRC\FREEGLUT_MAIN.C|C:\PROJECTS\IRG\BIBLIOTEKE\FREEGLUT-2.8.1\SRC\FREEGLUT_MENU.C|C:\PROJECTS\IRG\BIBLIOTEKE\FREEGLUT-2.8.1\SRC\FREEGLUT_MISC.C|C:\PROJECTS\IRG\BIBLIOTEKE\FREEGLUT-2.8.1\SRC\FREEGLUT_OVERLAY.C|C:\PROJECTS\IRG\BIBLIOTEKE\FREEGLUT-2.8.1\SRC\FREEGLUT_SPACEBALL.C|C:\PROJECTS\IRG\BIBLIOTEKE\FREEGLUT-2.8.1\SRC\FREEGLUT_STATE.C|C:\PROJECTS\IRG\BIBLIOTEKE\FREEGLUT-2.8.1\SRC\FREEGLUT_STROKE_MONO_ROMAN.C|C:\PROJECTS\IRG\BIBLIOTEKE\FREEGLUT-2.8.1\SRC\FREEGLUT_STROKE_ROMAN.C|C:\PROJECTS\IRG\BIBLIOTEKE\FREEGLUT-2.8.1\SRC\FREEGLUT_STRUCTURE.C|C:\PROJECTS\IRG\BIBLIOTEKE\FREEGLUT-2.8.1\SRC\FREEGLUT_TEAPOT.C|C:\PROJECTS\IRG\BIBLIOTEKE\FREEGLUT-2.8.1\SRC\FREEGLUT_VIDEORESIZE.C|C:\PROJECTS\IRG\BIBLIOTEKE\FREEGLUT-2.8.1\SRC\FREEGLUT_WINDOW.C
C:\PROJECTS\IRG\BIBLIOTEKE\FREEGLUT-2.8.1\VISUALSTUDIO\2012\BUILD\DEBUG\WIN32_V120\VC120.PDB
C:\PROJECTS\IRG\BIBLIOTEKE\FREEGLUT-2.8.1\VISUALSTUDIO\2012\BUILD\DEBUG\WIN32_V120\VC120.IDB
C:\PROJECTS\IRG\BIBLIOTEKE\FREEGLUT-2.8.1\VISUALSTUDIO\2012\BUILD\DEBUG\WIN32_V120\FREEGLUT_FONT.OBJ
C:\PROJECTS\IRG\BIBLIOTEKE\FREEGLUT-2.8.1\VISUALSTUDIO\2012\BUILD\DEBUG\WIN32_V120\FREEGLUT_FONT_DATA.OBJ
C:\PROJECTS\IRG\BIBLIOTEKE\FREEGLUT-2.8.1\VISUALSTUDIO\2012\BUILD\DEBUG\WIN32_V120\FREEGLUT_GAMEMODE.OBJ
C:\PROJECTS\IRG\BIBLIOTEKE\FREEGLUT-2.8.1\VISUALSTUDIO\2012\BUILD\DEBUG\WIN32_V120\FREEGLUT_GEOMETRY.OBJ
C:\PROJECTS\IRG\BIBLIOTEKE\FREEGLUT-2.8.1\VISUALSTUDIO\2012\BUILD\DEBUG\WIN32_V120\FREEGLUT_GLUTFONT_DEFINITIONS.OBJ
C:\PROJECTS\IRG\BIBLIOTEKE\FREEGLUT-2.8.1\VISUALSTUDIO\2012\BUILD\DEBUG\WIN32_V120\FREEGLUT_INIT.OBJ
C:\PROJECTS\IRG\BIBLIOTEKE\FREEGLUT-2.8.1\VISUALSTUDIO\2012\BUILD\DEBUG\WIN32_V120\FREEGLUT_INPUT_DEVICES.OBJ
C:\PROJECTS\IRG\BIBLIOTEKE\FREEGLUT-2.8.1\VISUALSTUDIO\2012\BUILD\DEBUG\WIN32_V120\FREEGLUT_JOYSTICK.OBJ
C:\PROJECTS\IRG\BIBLIOTEKE\FREEGLUT-2.8.1\VISUALSTUDIO\2012\BUILD\DEBUG\WIN32_V120\FREEGLUT_MAIN.OBJ
C:\PROJECTS\IRG\BIBLIOTEKE\FREEGLUT-2.8.1\VISUALSTUDIO\2012\BUILD\DEBUG\WIN32_V120\FREEGLUT_MENU.OBJ
C:\PROJECTS\IRG\BIBLIOTEKE\FREEGLUT-2.8.1\VISUALSTUDIO\2012\BUILD\DEBUG\WIN32_V120\FREEGLUT_MISC.OBJ
C:\PROJECTS\IRG\BIBLIOTEKE\FREEGLUT-2.8.1\VISUALSTUDIO\2012\BUILD\DEBUG\WIN32_V120\FREEGLUT_OVERLAY.OBJ
C:\PROJECTS\IRG\BIBLIOTEKE\FREEGLUT-2.8.1\VISUALSTUDIO\2012\BUILD\DEBUG\WIN32_V120\FREEGLUT_SPACEBALL.OBJ
C:\PROJECTS\IRG\BIBLIOTEKE\FREEGLUT-2.8.1\VISUALSTUDIO\2012\BUILD\DEBUG\WIN32_V120\FREEGLUT_STATE.OBJ
C:\PROJECTS\IRG\BIBLIOTEKE\FREEGLUT-2.8.1\VISUALSTUDIO\2012\BUILD\DEBUG\WIN32_V120\FREEGLUT_STROKE_MONO_ROMAN.OBJ
C:\PROJECTS\IRG\BIBLIOTEKE\FREEGLUT-2.8.1\VISUALSTUDIO\2012\BUILD\DEBUG\WIN32_V120\FREEGLUT_STROKE_ROMAN.OBJ
C:\PROJECTS\IRG\BIBLIOTEKE\FREEGLUT-2.8.1\VISUALSTUDIO\2012\BUILD\DEBUG\WIN32_V120\FREEGLUT_STRUCTURE.OBJ
C:\PROJECTS\IRG\BIBLIOTEKE\FREEGLUT-2.8.1\VISUALSTUDIO\2012\BUILD\DEBUG\WIN32_V120\FREEGLUT_TEAPOT.OBJ
C:\PROJECTS\IRG\BIBLIOTEKE\FREEGLUT-2.8.1\VISUALSTUDIO\2012\BUILD\DEBUG\WIN32_V120\FREEGLUT_VIDEORESIZE.OBJ
C:\PROJECTS\IRG\BIBLIOTEKE\FREEGLUT-2.8.1\VISUALSTUDIO\2012\BUILD\DEBUG\WIN32_V120\FREEGLUT_WINDOW.OBJ
C:\PROJECTS\IRG\BIBLIOTEKE\FREEGLUT-2.8.1\VISUALSTUDIO\2012\BUILD\DEBUG\WIN32_V120\FREEGLUT_CALLBACKS.OBJ
C:\PROJECTS\IRG\BIBLIOTEKE\FREEGLUT-2.8.1\VISUALSTUDIO\2012\BUILD\DEBUG\WIN32_V120\FREEGLUT_CURSOR.OBJ
C:\PROJECTS\IRG\BIBLIOTEKE\FREEGLUT-2.8.1\VISUALSTUDIO\2012\BUILD\DEBUG\WIN32_V120\FREEGLUT_DISPLAY.OBJ
C:\PROJECTS\IRG\BIBLIOTEKE\FREEGLUT-2.8.1\VISUALSTUDIO\2012\BUILD\DEBUG\WIN32_V120\FREEGLUT_EXT.OBJ
^C:\PROJECTS\IRG\BIBLIOTEKE\FREEGLUT-2.8.1\SRC\FREEGLUT_CALLBACKS.C
C:\PROJECTS\IRG\BIBLIOTEKE\FREEGLUT-2.8.1\VISUALSTUDIO\2012\BUILD\DEBUG\WIN32_V120\VC120.PDB
^C:\PROJECTS\IRG\BIBLIOTEKE\FREEGLUT-2.8.1\SRC\FREEGLUT_CURSOR.C
C:\PROJECTS\IRG\BIBLIOTEKE\FREEGLUT-2.8.1\VISUALSTUDIO\2012\BUILD\DEBUG\WIN32_V120\VC120.PDB
^C:\PROJECTS\IRG\BIBLIOTEKE\FREEGLUT-2.8.1\SRC\FREEGLUT_DISPLAY.C
C:\PROJECTS\IRG\BIBLIOTEKE\FREEGLUT-2.8.1\VISUALSTUDIO\2012\BUILD\DEBUG\WIN32_V120\VC120.PDB
^C:\PROJECTS\IRG\BIBLIOTEKE\FREEGLUT-2.8.1\SRC\FREEGLUT_EXT.C
C:\PROJECTS\IRG\BIBLIOTEKE\FREEGLUT-2.8.1\VISUALSTUDIO\2012\BUILD\DEBUG\WIN32_V120\VC120.PDB
^C:\PROJECTS\IRG\BIBLIOTEKE\FREEGLUT-2.8.1\SRC\FREEGLUT_FONT.C
C:\PROJECTS\IRG\BIBLIOTEKE\FREEGLUT-2.8.1\VISUALSTUDIO\2012\BUILD\DEBUG\WIN32_V120\VC120.PDB
^C:\PROJECTS\IRG\BIBLIOTEKE\FREEGLUT-2.8.1\SRC\FREEGLUT_FONT_DATA.C
C:\PROJECTS\IRG\BIBLIOTEKE\FREEGLUT-2.8.1\VISUALSTUDIO\2012\BUILD\DEBUG\WIN32_V120\VC120.PDB
^C:\PROJECTS\IRG\BIBLIOTEKE\FREEGLUT-2.8.1\SRC\FREEGLUT_GAMEMODE.C
C:\PROJECTS\IRG\BIBLIOTEKE\FREEGLUT-2.8.1\VISUALSTUDIO\2012\BUILD\DEBUG\WIN32_V120\VC120.PDB
^C:\PROJECTS\IRG\BIBLIOTEKE\FREEGLUT-2.8.1\SRC\FREEGLUT_GEOMETRY.C
C:\PROJECTS\IRG\BIBLIOTEKE\FREEGLUT-2.8.1\VISUALSTUDIO\2012\BUILD\DEBUG\WIN32_V120\VC120.PDB
^C:\PROJECTS\IRG\BIBLIOTEKE\FREEGLUT-2.8.1\SRC\FREEGLUT_GLUTFONT_DEFINITIONS.C
C:\PROJECTS\IRG\BIBLIOTEKE\FREEGLUT-2.8.1\VISUALSTUDIO\2012\BUILD\DEBUG\WIN32_V120\VC120.PDB
^C:\PROJECTS\IRG\BIBLIOTEKE\FREEGLUT-2.8.1\SRC\FREEGLUT_INIT.C
C:\PROJECTS\IRG\BIBLIOTEKE\FREEGLUT-2.8.1\VISUALSTUDIO\2012\BUILD\DEBUG\WIN32_V120\VC120.PDB
^C:\PROJECTS\IRG\BIBLIOTEKE\FREEGLUT-2.8.1\SRC\FREEGLUT_INPUT_DEVICES.C
C:\PROJECTS\IRG\BIBLIOTEKE\FREEGLUT-2.8.1\VISUALSTUDIO\2012\BUILD\DEBUG\WIN32_V120\VC120.PDB
^C:\PROJECTS\IRG\BIBLIOTEKE\FREEGLUT-2.8.1\SRC\FREEGLUT_JOYSTICK.C
C:\PROJECTS\IRG\BIBLIOTEKE\FREEGLUT-2.8.1\VISUALSTUDIO\2012\BUILD\DEBUG\WIN32_V120\VC120.PDB
^C:\PROJECTS\IRG\BIBLIOTEKE\FREEGLUT-2.8.1\SRC\FREEGLUT_MAIN.C
C:\PROJECTS\IRG\BIBLIOTEKE\FREEGLUT-2.8.1\VISUALSTUDIO\2012\BUILD\DEBUG\WIN32_V120\VC120.PDB
^C:\PROJECTS\IRG\BIBLIOTEKE\FREEGLUT-2.8.1\SRC\FREEGLUT_MENU.C
C:\PROJECTS\IRG\BIBLIOTEKE\FREEGLUT-2.8.1\VISUALSTUDIO\2012\BUILD\DEBUG\WIN32_V120\VC120.PDB
^C:\PROJECTS\IRG\BIBLIOTEKE\FREEGLUT-2.8.1\SRC\FREEGLUT_MISC.C
C:\PROJECTS\IRG\BIBLIOTEKE\FREEGLUT-2.8.1\VISUALSTUDIO\2012\BUILD\DEBUG\WIN32_V120\VC120.PDB
^C:\PROJECTS\IRG\BIBLIOTEKE\FREEGLUT-2.8.1\SRC\FREEGLUT_OVERLAY.C
C:\PROJECTS\IRG\BIBLIOTEKE\FREEGLUT-2.8.1\VISUALSTUDIO\2012\BUILD\DEBUG\WIN32_V120\VC120.PDB
^C:\PROJECTS\IRG\BIBLIOTEKE\FREEGLUT-2.8.1\SRC\FREEGLUT_SPACEBALL.C
C:\PROJECTS\IRG\BIBLIOTEKE\FREEGLUT-2.8.1\VISUALSTUDIO\2012\BUILD\DEBUG\WIN32_V120\VC120.PDB
^C:\PROJECTS\IRG\BIBLIOTEKE\FREEGLUT-2.8.1\SRC\FREEGLUT_STATE.C
C:\PROJECTS\IRG\BIBLIOTEKE\FREEGLUT-2.8.1\VISUALSTUDIO\2012\BUILD\DEBUG\WIN32_V120\VC120.PDB
^C:\PROJECTS\IRG\BIBLIOTEKE\FREEGLUT-2.8.1\SRC\FREEGLUT_STROKE_MONO_ROMAN.C
C:\PROJECTS\IRG\BIBLIOTEKE\FREEGLUT-2.8.1\VISUALSTUDIO\2012\BUILD\DEBUG\WIN32_V120\VC120.PDB
^C:\PROJECTS\IRG\BIBLIOTEKE\FREEGLUT-2.8.1\SRC\FREEGLUT_STROKE_ROMAN.C
C:\PROJECTS\IRG\BIBLIOTEKE\FREEGLUT-2.8.1\VISUALSTUDIO\2012\BUILD\DEBUG\WIN32_V120\VC120.PDB
^C:\PROJECTS\IRG\BIBLIOTEKE\FREEGLUT-2.8.1\SRC\FREEGLUT_STRUCTURE.C
C:\PROJECTS\IRG\BIBLIOTEKE\FREEGLUT-2.8.1\VISUALSTUDIO\2012\BUILD\DEBUG\WIN32_V120\VC120.PDB
^C:\PROJECTS\IRG\BIBLIOTEKE\FREEGLUT-2.8.1\SRC\FREEGLUT_TEAPOT.C
C:\PROJECTS\IRG\BIBLIOTEKE\FREEGLUT-2.8.1\VISUALSTUDIO\2012\BUILD\DEBUG\WIN32_V120\VC120.PDB
^C:\PROJECTS\IRG\BIBLIOTEKE\FREEGLUT-2.8.1\SRC\FREEGLUT_VIDEORESIZE.C
C:\PROJECTS\IRG\BIBLIOTEKE\FREEGLUT-2.8.1\VISUALSTUDIO\2012\BUILD\DEBUG\WIN32_V120\VC120.PDB
^C:\PROJECTS\IRG\BIBLIOTEKE\FREEGLUT-2.8.1\SRC\FREEGLUT_WINDOW.C
C:\PROJECTS\IRG\BIBLIOTEKE\FREEGLUT-2.8.1\VISUALSTUDIO\2012\BUILD\DEBUG\WIN32_V120\VC120.PDB
