^C:\PROJECTS\IRG\BIBLIOTEKE\FREEGLUT-2.8.1\VISUALSTUDIO\2012\BUILD\DEBUG\WIN32_V120\FREEGLUT.RES|C:\PROJECTS\IRG\BIBLIOTEKE\FREEGLUT-2.8.1\VISUALSTUDIO\2012\BUILD\DEBUG\WIN32_V120\FREEGLUT_CALLBACKS.OBJ|C:\PROJECTS\IRG\BIBLIOTEKE\FREEGLUT-2.8.1\VISUALSTUDIO\2012\BUILD\DEBUG\WIN32_V120\FREEGLUT_CURSOR.OBJ|C:\PROJECTS\IRG\BIBLIOTEKE\FREEGLUT-2.8.1\VISUALSTUDIO\2012\BUILD\DEBUG\WIN32_V120\FREEGLUT_DISPLAY.OBJ|C:\PROJECTS\IRG\BIBLIOTEKE\FREEGLUT-2.8.1\VISUALSTUDIO\2012\BUILD\DEBUG\WIN32_V120\FREEGLUT_EXT.OBJ|C:\PROJECTS\IRG\BIBLIOTEKE\FREEGLUT-2.8.1\VISUALSTUDIO\2012\BUILD\DEBUG\WIN32_V120\FREEGLUT_FONT.OBJ|C:\PROJECTS\IRG\BIBLIOTEKE\FREEGLUT-2.8.1\VISUALSTUDIO\2012\BUILD\DEBUG\WIN32_V120\FREEGLUT_FONT_DATA.OBJ|C:\PROJECTS\IRG\BIBLIOTEKE\FREEGLUT-2.8.1\VISUALSTUDIO\2012\BUILD\DEBUG\WIN32_V120\FREEGLUT_GAMEMODE.OBJ|C:\PROJECTS\IRG\BIBLIOTEKE\FREEGLUT-2.8.1\VISUALSTUDIO\2012\BUILD\DEBUG\WIN32_V120\FREEGLUT_GEOMETRY.OBJ|C:\PROJECTS\IRG\BIBLIOTEKE\FREEGLUT-2.8.1\VISUALSTUDIO\2012\BUILD\DEBUG\WIN32_V120\FREEGLUT_GLUTFONT_DEFINITIONS.OBJ|C:\PROJECTS\IRG\BIBLIOTEKE\FREEGLUT-2.8.1\VISUALSTUDIO\2012\BUILD\DEBUG\WIN32_V120\FREEGLUT_INIT.OBJ|C:\PROJECTS\IRG\BIBLIOTEKE\FREEGLUT-2.8.1\VISUALSTUDIO\2012\BUILD\DEBUG\WIN32_V120\FREEGLUT_INPUT_DEVICES.OBJ|C:\PROJECTS\IRG\BIBLIOTEKE\FREEGLUT-2.8.1\VISUALSTUDIO\2012\BUILD\DEBUG\WIN32_V120\FREEGLUT_JOYSTICK.OBJ|C:\PROJECTS\IRG\BIBLIOTEKE\FREEGLUT-2.8.1\VISUALSTUDIO\2012\BUILD\DEBUG\WIN32_V120\FREEGLUT_MAIN.OBJ|C:\PROJECTS\IRG\BIBLIOTEKE\FREEGLUT-2.8.1\VISUALSTUDIO\2012\BUILD\DEBUG\WIN32_V120\FREEGLUT_MENU.OBJ|C:\PROJECTS\IRG\BIBLIOTEKE\FREEGLUT-2.8.1\VISUALSTUDIO\2012\BUILD\DEBUG\WIN32_V120\FREEGLUT_MISC.OBJ|C:\PROJECTS\IRG\BIBLIOTEKE\FREEGLUT-2.8.1\VISUALSTUDIO\2012\BUILD\DEBUG\WIN32_V120\FREEGLUT_OVERLAY.OBJ|C:\PROJECTS\IRG\BIBLIOTEKE\FREEGLUT-2.8.1\VISUALSTUDIO\2012\BUILD\DEBUG\WIN32_V120\FREEGLUT_SPACEBALL.OBJ|C:\PROJECTS\IRG\BIBLIOTEKE\FREEGLUT-2.8.1\VISUALSTUDIO\2012\BUILD\DEBUG\WIN32_V120\FREEGLUT_STATE.OBJ|C:\PROJECTS\IRG\BIBLIOTEKE\FREEGLUT-2.8.1\VISUALSTUDIO\2012\BUILD\DEBUG\WIN32_V120\FREEGLUT_STROKE_MONO_ROMAN.OBJ|C:\PROJECTS\IRG\BIBLIOTEKE\FREEGLUT-2.8.1\VISUALSTUDIO\2012\BUILD\DEBUG\WIN32_V120\FREEGLUT_STROKE_ROMAN.OBJ|C:\PROJECTS\IRG\BIBLIOTEKE\FREEGLUT-2.8.1\VISUALSTUDIO\2012\BUILD\DEBUG\WIN32_V120\FREEGLUT_STRUCTURE.OBJ|C:\PROJECTS\IRG\BIBLIOTEKE\FREEGLUT-2.8.1\VISUALSTUDIO\2012\BUILD\DEBUG\WIN32_V120\FREEGLUT_TEAPOT.OBJ|C:\PROJECTS\IRG\BIBLIOTEKE\FREEGLUT-2.8.1\VISUALSTUDIO\2012\BUILD\DEBUG\WIN32_V120\FREEGLUT_VIDEORESIZE.OBJ|C:\PROJECTS\IRG\BIBLIOTEKE\FREEGLUT-2.8.1\VISUALSTUDIO\2012\BUILD\DEBUG\WIN32_V120\FREEGLUT_WINDOW.OBJ
C:\PROGRAM FILES (X86)\WINDOWS KITS\8.1\LIB\WINV6.3\UM\X86\KERNEL32.LIB
C:\PROGRAM FILES (X86)\WINDOWS KITS\8.1\LIB\WINV6.3\UM\X86\USER32.LIB
C:\PROGRAM FILES (X86)\WINDOWS KITS\8.1\LIB\WINV6.3\UM\X86\GDI32.LIB
C:\PROGRAM FILES (X86)\WINDOWS KITS\8.1\LIB\WINV6.3\UM\X86\WINSPOOL.LIB
C:\PROGRAM FILES (X86)\WINDOWS KITS\8.1\LIB\WINV6.3\UM\X86\COMDLG32.LIB
C:\PROGRAM FILES (X86)\WINDOWS KITS\8.1\LIB\WINV6.3\UM\X86\ADVAPI32.LIB
C:\PROGRAM FILES (X86)\WINDOWS KITS\8.1\LIB\WINV6.3\UM\X86\SHELL32.LIB
C:\PROGRAM FILES (X86)\WINDOWS KITS\8.1\LIB\WINV6.3\UM\X86\OLE32.LIB
C:\PROGRAM FILES (X86)\WINDOWS KITS\8.1\LIB\WINV6.3\UM\X86\OLEAUT32.LIB
C:\PROGRAM FILES (X86)\WINDOWS KITS\8.1\LIB\WINV6.3\UM\X86\UUID.LIB
C:\PROGRAM FILES (X86)\WINDOWS KITS\8.1\LIB\WINV6.3\UM\X86\ODBC32.LIB
C:\PROGRAM FILES (X86)\WINDOWS KITS\8.1\LIB\WINV6.3\UM\X86\ODBCCP32.LIB
C:\PROJECTS\IRG\BIBLIOTEKE\FREEGLUT-2.8.1\VISUALSTUDIO\2012\BUILD\DEBUG\WIN32_V120\FREEGLUT.RES
C:\PROJECTS\IRG\BIBLIOTEKE\FREEGLUT-2.8.1\VISUALSTUDIO\2012\BUILD\DEBUG\WIN32_V120\FREEGLUT_CALLBACKS.OBJ
C:\PROJECTS\IRG\BIBLIOTEKE\FREEGLUT-2.8.1\VISUALSTUDIO\2012\BUILD\DEBUG\WIN32_V120\FREEGLUT_CURSOR.OBJ
C:\PROJECTS\IRG\BIBLIOTEKE\FREEGLUT-2.8.1\VISUALSTUDIO\2012\BUILD\DEBUG\WIN32_V120\FREEGLUT_DISPLAY.OBJ
C:\PROJECTS\IRG\BIBLIOTEKE\FREEGLUT-2.8.1\VISUALSTUDIO\2012\BUILD\DEBUG\WIN32_V120\FREEGLUT_EXT.OBJ
C:\PROJECTS\IRG\BIBLIOTEKE\FREEGLUT-2.8.1\VISUALSTUDIO\2012\BUILD\DEBUG\WIN32_V120\FREEGLUT_FONT.OBJ
C:\PROJECTS\IRG\BIBLIOTEKE\FREEGLUT-2.8.1\VISUALSTUDIO\2012\BUILD\DEBUG\WIN32_V120\FREEGLUT_FONT_DATA.OBJ
C:\PROJECTS\IRG\BIBLIOTEKE\FREEGLUT-2.8.1\VISUALSTUDIO\2012\BUILD\DEBUG\WIN32_V120\FREEGLUT_GAMEMODE.OBJ
C:\PROJECTS\IRG\BIBLIOTEKE\FREEGLUT-2.8.1\VISUALSTUDIO\2012\BUILD\DEBUG\WIN32_V120\FREEGLUT_GEOMETRY.OBJ
C:\PROJECTS\IRG\BIBLIOTEKE\FREEGLUT-2.8.1\VISUALSTUDIO\2012\BUILD\DEBUG\WIN32_V120\FREEGLUT_GLUTFONT_DEFINITIONS.OBJ
C:\PROJECTS\IRG\BIBLIOTEKE\FREEGLUT-2.8.1\VISUALSTUDIO\2012\BUILD\DEBUG\WIN32_V120\FREEGLUT_INIT.OBJ
C:\PROJECTS\IRG\BIBLIOTEKE\FREEGLUT-2.8.1\VISUALSTUDIO\2012\BUILD\DEBUG\WIN32_V120\FREEGLUT_INPUT_DEVICES.OBJ
C:\PROJECTS\IRG\BIBLIOTEKE\FREEGLUT-2.8.1\VISUALSTUDIO\2012\BUILD\DEBUG\WIN32_V120\FREEGLUT_JOYSTICK.OBJ
C:\PROJECTS\IRG\BIBLIOTEKE\FREEGLUT-2.8.1\VISUALSTUDIO\2012\BUILD\DEBUG\WIN32_V120\FREEGLUT_MAIN.OBJ
C:\PROJECTS\IRG\BIBLIOTEKE\FREEGLUT-2.8.1\VISUALSTUDIO\2012\BUILD\DEBUG\WIN32_V120\FREEGLUT_MENU.OBJ
C:\PROJECTS\IRG\BIBLIOTEKE\FREEGLUT-2.8.1\VISUALSTUDIO\2012\BUILD\DEBUG\WIN32_V120\FREEGLUT_MISC.OBJ
C:\PROJECTS\IRG\BIBLIOTEKE\FREEGLUT-2.8.1\VISUALSTUDIO\2012\BUILD\DEBUG\WIN32_V120\FREEGLUT_OVERLAY.OBJ
C:\PROJECTS\IRG\BIBLIOTEKE\FREEGLUT-2.8.1\VISUALSTUDIO\2012\BUILD\DEBUG\WIN32_V120\FREEGLUT_SPACEBALL.OBJ
C:\PROJECTS\IRG\BIBLIOTEKE\FREEGLUT-2.8.1\VISUALSTUDIO\2012\BUILD\DEBUG\WIN32_V120\FREEGLUT_STATE.OBJ
C:\PROJECTS\IRG\BIBLIOTEKE\FREEGLUT-2.8.1\VISUALSTUDIO\2012\BUILD\DEBUG\WIN32_V120\FREEGLUT_STROKE_MONO_ROMAN.OBJ
C:\PROJECTS\IRG\BIBLIOTEKE\FREEGLUT-2.8.1\VISUALSTUDIO\2012\BUILD\DEBUG\WIN32_V120\FREEGLUT_STROKE_ROMAN.OBJ
C:\PROJECTS\IRG\BIBLIOTEKE\FREEGLUT-2.8.1\VISUALSTUDIO\2012\BUILD\DEBUG\WIN32_V120\FREEGLUT_STRUCTURE.OBJ
C:\PROJECTS\IRG\BIBLIOTEKE\FREEGLUT-2.8.1\VISUALSTUDIO\2012\BUILD\DEBUG\WIN32_V120\FREEGLUT_TEAPOT.OBJ
C:\PROJECTS\IRG\BIBLIOTEKE\FREEGLUT-2.8.1\VISUALSTUDIO\2012\BUILD\DEBUG\WIN32_V120\FREEGLUT_VIDEORESIZE.OBJ
C:\PROJECTS\IRG\BIBLIOTEKE\FREEGLUT-2.8.1\VISUALSTUDIO\2012\BUILD\DEBUG\WIN32_V120\FREEGLUT_WINDOW.OBJ
C:\WINDOWS\GLOBALIZATION\SORTING\SORTDEFAULT.NLS
C:\PROGRAM FILES (X86)\WINDOWS KITS\8.1\LIB\WINV6.3\UM\X86\GLU32.LIB
C:\PROGRAM FILES (X86)\WINDOWS KITS\8.1\LIB\WINV6.3\UM\X86\OPENGL32.LIB
C:\PROGRAM FILES (X86)\WINDOWS KITS\8.1\LIB\WINV6.3\UM\X86\WINMM.LIB
C:\PROGRAM FILES (X86)\MICROSOFT VISUAL STUDIO 12.0\VC\LIB\MSVCRTD.LIB
C:\PROGRAM FILES (X86)\MICROSOFT VISUAL STUDIO 12.0\VC\LIB\OLDNAMES.LIB
C:\PROJECTS\IRG\BIBLIOTEKE\FREEGLUT-2.8.1\SRC\FREEGLUTDLL.DEF
C:\WINDOWS\SYSTEM32\TZRES.DLL
C:\PROGRAM FILES (X86)\MICROSOFT VISUAL STUDIO 12.0\VC\BIN\1033\LINKUI.DLL
C:\PROGRAM FILES (X86)\WINDOWS KITS\8.1\BIN\X86\RC.EXE
C:\PROGRAM FILES (X86)\MICROSOFT VISUAL STUDIO 12.0\VC\BIN\CVTRES.EXE
