^C:\PROJECTS\IRG\RAG_LABOSI\RG2018\PROJEKT\MAINTEX.CPP|C:\PROJECTS\IRG\RAG_LABOSI\RG2018\PROJEKT\SHADER.CPP|C:\PROJECTS\IRG\RAG_LABOSI\RG2018\PROJEKT\UTIL.CPP
C:\PROJECTS\IRG\RAG_LABOSI\RG2018\PROJEKT\DEBUG\VC141.PDB
C:\PROJECTS\IRG\RAG_LABOSI\RG2018\PROJEKT\DEBUG\VC141.IDB
C:\PROJECTS\IRG\RAG_LABOSI\RG2018\PROJEKT\DEBUG\UTIL.OBJ
C:\PROJECTS\IRG\RAG_LABOSI\RG2018\PROJEKT\DEBUG\SHADER.OBJ
C:\PROJECTS\IRG\RAG_LABOSI\RG2018\PROJEKT\DEBUG\MAINTEX.OBJ
^C:\PROJECTS\IRG\RAG_LABOSI\RG2018\PROJEKT\MAINTEX.CPP
C:\PROJECTS\IRG\RAG_LABOSI\RG2018\PROJEKT\DEBUG\VC141.PDB
^C:\PROJECTS\IRG\RAG_LABOSI\RG2018\PROJEKT\SHADER.CPP
C:\PROJECTS\IRG\RAG_LABOSI\RG2018\PROJEKT\DEBUG\VC141.PDB
^C:\PROJECTS\IRG\RAG_LABOSI\RG2018\PROJEKT\UTIL.CPP
C:\PROJECTS\IRG\RAG_LABOSI\RG2018\PROJEKT\DEBUG\VC141.PDB
