^C:\PROJECTS\IRG\BIBLIOTEKE\FREEGLUT-2.8.1\SRC\FREEGLUT_CALLBACKS.C
/c /I..\..\include /Zi /nologo /W3 /WX- /Od /Oy- /D _DEBUG /D WIN32 /D _WINDOWS /D _USRDLL /D FREEGLUT_EXPORTS /D _WINDLL /D _MBCS /Gm /EHsc /RTC1 /MDd /GS /fp:precise /Zc:wchar_t /Zc:forScope /Fo"BUILD\DEBUG\WIN32_V120\\" /Fd"BUILD\DEBUG\WIN32_V120\VC120.PDB" /Gd /TC /wd4996 /analyze- C:\PROJECTS\IRG\BIBLIOTEKE\FREEGLUT-2.8.1\SRC\FREEGLUT_CALLBACKS.C
^C:\PROJECTS\IRG\BIBLIOTEKE\FREEGLUT-2.8.1\SRC\FREEGLUT_CURSOR.C
/c /I..\..\include /Zi /nologo /W3 /WX- /Od /Oy- /D _DEBUG /D WIN32 /D _WINDOWS /D _USRDLL /D FREEGLUT_EXPORTS /D _WINDLL /D _MBCS /Gm /EHsc /RTC1 /MDd /GS /fp:precise /Zc:wchar_t /Zc:forScope /Fo"BUILD\DEBUG\WIN32_V120\\" /Fd"BUILD\DEBUG\WIN32_V120\VC120.PDB" /Gd /TC /wd4996 /analyze- C:\PROJECTS\IRG\BIBLIOTEKE\FREEGLUT-2.8.1\SRC\FREEGLUT_CURSOR.C
^C:\PROJECTS\IRG\BIBLIOTEKE\FREEGLUT-2.8.1\SRC\FREEGLUT_DISPLAY.C
/c /I..\..\include /Zi /nologo /W3 /WX- /Od /Oy- /D _DEBUG /D WIN32 /D _WINDOWS /D _USRDLL /D FREEGLUT_EXPORTS /D _WINDLL /D _MBCS /Gm /EHsc /RTC1 /MDd /GS /fp:precise /Zc:wchar_t /Zc:forScope /Fo"BUILD\DEBUG\WIN32_V120\\" /Fd"BUILD\DEBUG\WIN32_V120\VC120.PDB" /Gd /TC /wd4996 /analyze- C:\PROJECTS\IRG\BIBLIOTEKE\FREEGLUT-2.8.1\SRC\FREEGLUT_DISPLAY.C
^C:\PROJECTS\IRG\BIBLIOTEKE\FREEGLUT-2.8.1\SRC\FREEGLUT_EXT.C
/c /I..\..\include /Zi /nologo /W3 /WX- /Od /Oy- /D _DEBUG /D WIN32 /D _WINDOWS /D _USRDLL /D FREEGLUT_EXPORTS /D _WINDLL /D _MBCS /Gm /EHsc /RTC1 /MDd /GS /fp:precise /Zc:wchar_t /Zc:forScope /Fo"BUILD\DEBUG\WIN32_V120\\" /Fd"BUILD\DEBUG\WIN32_V120\VC120.PDB" /Gd /TC /wd4996 /analyze- C:\PROJECTS\IRG\BIBLIOTEKE\FREEGLUT-2.8.1\SRC\FREEGLUT_EXT.C
^C:\PROJECTS\IRG\BIBLIOTEKE\FREEGLUT-2.8.1\SRC\FREEGLUT_FONT.C
/c /I..\..\include /Zi /nologo /W3 /WX- /Od /Oy- /D _DEBUG /D WIN32 /D _WINDOWS /D _USRDLL /D FREEGLUT_EXPORTS /D _WINDLL /D _MBCS /Gm /EHsc /RTC1 /MDd /GS /fp:precise /Zc:wchar_t /Zc:forScope /Fo"BUILD\DEBUG\WIN32_V120\\" /Fd"BUILD\DEBUG\WIN32_V120\VC120.PDB" /Gd /TC /wd4996 /analyze- C:\PROJECTS\IRG\BIBLIOTEKE\FREEGLUT-2.8.1\SRC\FREEGLUT_FONT.C
^C:\PROJECTS\IRG\BIBLIOTEKE\FREEGLUT-2.8.1\SRC\FREEGLUT_FONT_DATA.C
/c /I..\..\include /Zi /nologo /W3 /WX- /Od /Oy- /D _DEBUG /D WIN32 /D _WINDOWS /D _USRDLL /D FREEGLUT_EXPORTS /D _WINDLL /D _MBCS /Gm /EHsc /RTC1 /MDd /GS /fp:precise /Zc:wchar_t /Zc:forScope /Fo"BUILD\DEBUG\WIN32_V120\\" /Fd"BUILD\DEBUG\WIN32_V120\VC120.PDB" /Gd /TC /wd4996 /analyze- C:\PROJECTS\IRG\BIBLIOTEKE\FREEGLUT-2.8.1\SRC\FREEGLUT_FONT_DATA.C
^C:\PROJECTS\IRG\BIBLIOTEKE\FREEGLUT-2.8.1\SRC\FREEGLUT_GAMEMODE.C
/c /I..\..\include /Zi /nologo /W3 /WX- /Od /Oy- /D _DEBUG /D WIN32 /D _WINDOWS /D _USRDLL /D FREEGLUT_EXPORTS /D _WINDLL /D _MBCS /Gm /EHsc /RTC1 /MDd /GS /fp:precise /Zc:wchar_t /Zc:forScope /Fo"BUILD\DEBUG\WIN32_V120\\" /Fd"BUILD\DEBUG\WIN32_V120\VC120.PDB" /Gd /TC /wd4996 /analyze- C:\PROJECTS\IRG\BIBLIOTEKE\FREEGLUT-2.8.1\SRC\FREEGLUT_GAMEMODE.C
^C:\PROJECTS\IRG\BIBLIOTEKE\FREEGLUT-2.8.1\SRC\FREEGLUT_GEOMETRY.C
/c /I..\..\include /Zi /nologo /W3 /WX- /Od /Oy- /D _DEBUG /D WIN32 /D _WINDOWS /D _USRDLL /D FREEGLUT_EXPORTS /D _WINDLL /D _MBCS /Gm /EHsc /RTC1 /MDd /GS /fp:precise /Zc:wchar_t /Zc:forScope /Fo"BUILD\DEBUG\WIN32_V120\\" /Fd"BUILD\DEBUG\WIN32_V120\VC120.PDB" /Gd /TC /wd4996 /analyze- C:\PROJECTS\IRG\BIBLIOTEKE\FREEGLUT-2.8.1\SRC\FREEGLUT_GEOMETRY.C
^C:\PROJECTS\IRG\BIBLIOTEKE\FREEGLUT-2.8.1\SRC\FREEGLUT_GLUTFONT_DEFINITIONS.C
/c /I..\..\include /Zi /nologo /W3 /WX- /Od /Oy- /D _DEBUG /D WIN32 /D _WINDOWS /D _USRDLL /D FREEGLUT_EXPORTS /D _WINDLL /D _MBCS /Gm /EHsc /RTC1 /MDd /GS /fp:precise /Zc:wchar_t /Zc:forScope /Fo"BUILD\DEBUG\WIN32_V120\\" /Fd"BUILD\DEBUG\WIN32_V120\VC120.PDB" /Gd /TC /wd4996 /analyze- C:\PROJECTS\IRG\BIBLIOTEKE\FREEGLUT-2.8.1\SRC\FREEGLUT_GLUTFONT_DEFINITIONS.C
^C:\PROJECTS\IRG\BIBLIOTEKE\FREEGLUT-2.8.1\SRC\FREEGLUT_INIT.C
/c /I..\..\include /Zi /nologo /W3 /WX- /Od /Oy- /D _DEBUG /D WIN32 /D _WINDOWS /D _USRDLL /D FREEGLUT_EXPORTS /D _WINDLL /D _MBCS /Gm /EHsc /RTC1 /MDd /GS /fp:precise /Zc:wchar_t /Zc:forScope /Fo"BUILD\DEBUG\WIN32_V120\\" /Fd"BUILD\DEBUG\WIN32_V120\VC120.PDB" /Gd /TC /wd4996 /analyze- C:\PROJECTS\IRG\BIBLIOTEKE\FREEGLUT-2.8.1\SRC\FREEGLUT_INIT.C
^C:\PROJECTS\IRG\BIBLIOTEKE\FREEGLUT-2.8.1\SRC\FREEGLUT_INPUT_DEVICES.C
/c /I..\..\include /Zi /nologo /W3 /WX- /Od /Oy- /D _DEBUG /D WIN32 /D _WINDOWS /D _USRDLL /D FREEGLUT_EXPORTS /D _WINDLL /D _MBCS /Gm /EHsc /RTC1 /MDd /GS /fp:precise /Zc:wchar_t /Zc:forScope /Fo"BUILD\DEBUG\WIN32_V120\\" /Fd"BUILD\DEBUG\WIN32_V120\VC120.PDB" /Gd /TC /wd4996 /analyze- C:\PROJECTS\IRG\BIBLIOTEKE\FREEGLUT-2.8.1\SRC\FREEGLUT_INPUT_DEVICES.C
^C:\PROJECTS\IRG\BIBLIOTEKE\FREEGLUT-2.8.1\SRC\FREEGLUT_JOYSTICK.C
/c /I..\..\include /Zi /nologo /W3 /WX- /Od /Oy- /D _DEBUG /D WIN32 /D _WINDOWS /D _USRDLL /D FREEGLUT_EXPORTS /D _WINDLL /D _MBCS /Gm /EHsc /RTC1 /MDd /GS /fp:precise /Zc:wchar_t /Zc:forScope /Fo"BUILD\DEBUG\WIN32_V120\\" /Fd"BUILD\DEBUG\WIN32_V120\VC120.PDB" /Gd /TC /wd4996 /analyze- C:\PROJECTS\IRG\BIBLIOTEKE\FREEGLUT-2.8.1\SRC\FREEGLUT_JOYSTICK.C
^C:\PROJECTS\IRG\BIBLIOTEKE\FREEGLUT-2.8.1\SRC\FREEGLUT_MAIN.C
/c /I..\..\include /Zi /nologo /W3 /WX- /Od /Oy- /D _DEBUG /D WIN32 /D _WINDOWS /D _USRDLL /D FREEGLUT_EXPORTS /D _WINDLL /D _MBCS /Gm /EHsc /RTC1 /MDd /GS /fp:precise /Zc:wchar_t /Zc:forScope /Fo"BUILD\DEBUG\WIN32_V120\\" /Fd"BUILD\DEBUG\WIN32_V120\VC120.PDB" /Gd /TC /wd4996 /analyze- C:\PROJECTS\IRG\BIBLIOTEKE\FREEGLUT-2.8.1\SRC\FREEGLUT_MAIN.C
^C:\PROJECTS\IRG\BIBLIOTEKE\FREEGLUT-2.8.1\SRC\FREEGLUT_MENU.C
/c /I..\..\include /Zi /nologo /W3 /WX- /Od /Oy- /D _DEBUG /D WIN32 /D _WINDOWS /D _USRDLL /D FREEGLUT_EXPORTS /D _WINDLL /D _MBCS /Gm /EHsc /RTC1 /MDd /GS /fp:precise /Zc:wchar_t /Zc:forScope /Fo"BUILD\DEBUG\WIN32_V120\\" /Fd"BUILD\DEBUG\WIN32_V120\VC120.PDB" /Gd /TC /wd4996 /analyze- C:\PROJECTS\IRG\BIBLIOTEKE\FREEGLUT-2.8.1\SRC\FREEGLUT_MENU.C
^C:\PROJECTS\IRG\BIBLIOTEKE\FREEGLUT-2.8.1\SRC\FREEGLUT_MISC.C
/c /I..\..\include /Zi /nologo /W3 /WX- /Od /Oy- /D _DEBUG /D WIN32 /D _WINDOWS /D _USRDLL /D FREEGLUT_EXPORTS /D _WINDLL /D _MBCS /Gm /EHsc /RTC1 /MDd /GS /fp:precise /Zc:wchar_t /Zc:forScope /Fo"BUILD\DEBUG\WIN32_V120\\" /Fd"BUILD\DEBUG\WIN32_V120\VC120.PDB" /Gd /TC /wd4996 /analyze- C:\PROJECTS\IRG\BIBLIOTEKE\FREEGLUT-2.8.1\SRC\FREEGLUT_MISC.C
^C:\PROJECTS\IRG\BIBLIOTEKE\FREEGLUT-2.8.1\SRC\FREEGLUT_OVERLAY.C
/c /I..\..\include /Zi /nologo /W3 /WX- /Od /Oy- /D _DEBUG /D WIN32 /D _WINDOWS /D _USRDLL /D FREEGLUT_EXPORTS /D _WINDLL /D _MBCS /Gm /EHsc /RTC1 /MDd /GS /fp:precise /Zc:wchar_t /Zc:forScope /Fo"BUILD\DEBUG\WIN32_V120\\" /Fd"BUILD\DEBUG\WIN32_V120\VC120.PDB" /Gd /TC /wd4996 /analyze- C:\PROJECTS\IRG\BIBLIOTEKE\FREEGLUT-2.8.1\SRC\FREEGLUT_OVERLAY.C
^C:\PROJECTS\IRG\BIBLIOTEKE\FREEGLUT-2.8.1\SRC\FREEGLUT_SPACEBALL.C
/c /I..\..\include /Zi /nologo /W3 /WX- /Od /Oy- /D _DEBUG /D WIN32 /D _WINDOWS /D _USRDLL /D FREEGLUT_EXPORTS /D _WINDLL /D _MBCS /Gm /EHsc /RTC1 /MDd /GS /fp:precise /Zc:wchar_t /Zc:forScope /Fo"BUILD\DEBUG\WIN32_V120\\" /Fd"BUILD\DEBUG\WIN32_V120\VC120.PDB" /Gd /TC /wd4996 /analyze- C:\PROJECTS\IRG\BIBLIOTEKE\FREEGLUT-2.8.1\SRC\FREEGLUT_SPACEBALL.C
^C:\PROJECTS\IRG\BIBLIOTEKE\FREEGLUT-2.8.1\SRC\FREEGLUT_STATE.C
/c /I..\..\include /Zi /nologo /W3 /WX- /Od /Oy- /D _DEBUG /D WIN32 /D _WINDOWS /D _USRDLL /D FREEGLUT_EXPORTS /D _WINDLL /D _MBCS /Gm /EHsc /RTC1 /MDd /GS /fp:precise /Zc:wchar_t /Zc:forScope /Fo"BUILD\DEBUG\WIN32_V120\\" /Fd"BUILD\DEBUG\WIN32_V120\VC120.PDB" /Gd /TC /wd4996 /analyze- C:\PROJECTS\IRG\BIBLIOTEKE\FREEGLUT-2.8.1\SRC\FREEGLUT_STATE.C
^C:\PROJECTS\IRG\BIBLIOTEKE\FREEGLUT-2.8.1\SRC\FREEGLUT_STROKE_MONO_ROMAN.C
/c /I..\..\include /Zi /nologo /W3 /WX- /Od /Oy- /D _DEBUG /D WIN32 /D _WINDOWS /D _USRDLL /D FREEGLUT_EXPORTS /D _WINDLL /D _MBCS /Gm /EHsc /RTC1 /MDd /GS /fp:precise /Zc:wchar_t /Zc:forScope /Fo"BUILD\DEBUG\WIN32_V120\\" /Fd"BUILD\DEBUG\WIN32_V120\VC120.PDB" /Gd /TC /wd4996 /analyze- C:\PROJECTS\IRG\BIBLIOTEKE\FREEGLUT-2.8.1\SRC\FREEGLUT_STROKE_MONO_ROMAN.C
^C:\PROJECTS\IRG\BIBLIOTEKE\FREEGLUT-2.8.1\SRC\FREEGLUT_STROKE_ROMAN.C
/c /I..\..\include /Zi /nologo /W3 /WX- /Od /Oy- /D _DEBUG /D WIN32 /D _WINDOWS /D _USRDLL /D FREEGLUT_EXPORTS /D _WINDLL /D _MBCS /Gm /EHsc /RTC1 /MDd /GS /fp:precise /Zc:wchar_t /Zc:forScope /Fo"BUILD\DEBUG\WIN32_V120\\" /Fd"BUILD\DEBUG\WIN32_V120\VC120.PDB" /Gd /TC /wd4996 /analyze- C:\PROJECTS\IRG\BIBLIOTEKE\FREEGLUT-2.8.1\SRC\FREEGLUT_STROKE_ROMAN.C
^C:\PROJECTS\IRG\BIBLIOTEKE\FREEGLUT-2.8.1\SRC\FREEGLUT_STRUCTURE.C
/c /I..\..\include /Zi /nologo /W3 /WX- /Od /Oy- /D _DEBUG /D WIN32 /D _WINDOWS /D _USRDLL /D FREEGLUT_EXPORTS /D _WINDLL /D _MBCS /Gm /EHsc /RTC1 /MDd /GS /fp:precise /Zc:wchar_t /Zc:forScope /Fo"BUILD\DEBUG\WIN32_V120\\" /Fd"BUILD\DEBUG\WIN32_V120\VC120.PDB" /Gd /TC /wd4996 /analyze- C:\PROJECTS\IRG\BIBLIOTEKE\FREEGLUT-2.8.1\SRC\FREEGLUT_STRUCTURE.C
^C:\PROJECTS\IRG\BIBLIOTEKE\FREEGLUT-2.8.1\SRC\FREEGLUT_TEAPOT.C
/c /I..\..\include /Zi /nologo /W3 /WX- /Od /Oy- /D _DEBUG /D WIN32 /D _WINDOWS /D _USRDLL /D FREEGLUT_EXPORTS /D _WINDLL /D _MBCS /Gm /EHsc /RTC1 /MDd /GS /fp:precise /Zc:wchar_t /Zc:forScope /Fo"BUILD\DEBUG\WIN32_V120\\" /Fd"BUILD\DEBUG\WIN32_V120\VC120.PDB" /Gd /TC /wd4996 /analyze- C:\PROJECTS\IRG\BIBLIOTEKE\FREEGLUT-2.8.1\SRC\FREEGLUT_TEAPOT.C
^C:\PROJECTS\IRG\BIBLIOTEKE\FREEGLUT-2.8.1\SRC\FREEGLUT_VIDEORESIZE.C
/c /I..\..\include /Zi /nologo /W3 /WX- /Od /Oy- /D _DEBUG /D WIN32 /D _WINDOWS /D _USRDLL /D FREEGLUT_EXPORTS /D _WINDLL /D _MBCS /Gm /EHsc /RTC1 /MDd /GS /fp:precise /Zc:wchar_t /Zc:forScope /Fo"BUILD\DEBUG\WIN32_V120\\" /Fd"BUILD\DEBUG\WIN32_V120\VC120.PDB" /Gd /TC /wd4996 /analyze- C:\PROJECTS\IRG\BIBLIOTEKE\FREEGLUT-2.8.1\SRC\FREEGLUT_VIDEORESIZE.C
^C:\PROJECTS\IRG\BIBLIOTEKE\FREEGLUT-2.8.1\SRC\FREEGLUT_WINDOW.C
/c /I..\..\include /Zi /nologo /W3 /WX- /Od /Oy- /D _DEBUG /D WIN32 /D _WINDOWS /D _USRDLL /D FREEGLUT_EXPORTS /D _WINDLL /D _MBCS /Gm /EHsc /RTC1 /MDd /GS /fp:precise /Zc:wchar_t /Zc:forScope /Fo"BUILD\DEBUG\WIN32_V120\\" /Fd"BUILD\DEBUG\WIN32_V120\VC120.PDB" /Gd /TC /wd4996 /analyze- C:\PROJECTS\IRG\BIBLIOTEKE\FREEGLUT-2.8.1\SRC\FREEGLUT_WINDOW.C
