{
  "dbs": {
    "smaps_db": {
      "name": "smaps",
      "collections": {
        "entities": "entities",
        "relations": "relations"
      }
    }
  },

  "catalog_spreadsheet_id": "1Ne7rDBCgR71SOoZTPDNhfz2yywKp3EXfWaWBhlZY9Pg",
  "catalog_sheet_title": "Granthas",
  
  "vakyas_sheet_title" : "Vakyas",
  "sambandhas_sheet_title" : "Sambandhas"
}