{
  "oauth": {
    "google": {
      "client_secret_file_base_path": "oauth/google/vedavaapi/client1/client_secret.json"
    },
    "facebook": {
      "client_secret_file_base_path": "oauth/facebook/vedavaapi/client0/client_secret.json"
    }
  },
  "initial_users": [
    {
      "jsonClass": "User",
      "type": "foaf:Agent",
      "agentClass": "Person",
      "authentication_infos": [
        {
          "jsonClass": "AuthenticationInfo",
          "type": "owl:Thing",
          "user_id": "VedavaapiAdmin",
          "provider": "vedavaapi",
          "secret_bcrypt": "$2b$12$zZI9xVCrVQfZlCMR1mANZOmmtSNV4hX5GIatXYzQL233.YzUi2Ddu"
        }
      ],
      "permissions": {
        "jsonClass": "UserPermissions",
        "type": "owl:Thing",
        "global_scope": {
          "jsonClass": "Permission",
          "type": "sld:Permission",
          "given": [
            "create",
            "read",
            "update",
            "delete",
            "admin"
          ],
          "withdrawn": []
        }
      }
    }
  ],

  "default_permissions": {
    "jsonClass": "UserPermissions",
    "type": "owl:Thing",
    "global_scope": {
      "jsonClass": "Permission",
      "type": "sld:Permission",
      "given": [
        "read"
      ],
      "withdrawn": []
    }
  },

  "dbs": {
    "users_db": {
      "name": "users",
      "collections": {
        "users": "users"
      }
    }
  }
}
