{
  "@context": [{
    "oa": "http://www.w3.org/ns/oa#",
    "dc": "http://purl.org/dc/elements/1.1/",
    "dcterms": "http://purl.org/dc/terms/",
    "dctypes": "http://purl.org/dc/dcmitype/",
    "rdf": "http://www.w3.org/1999/02/22-rdf-syntax-ns#",
    "rdfs": "http://www.w3.org/2000/01/rdf-schema#",
    "vv": "https://api.vedavaapi.org/namespace.jsonld",

    "_id": "@id",
    "type": "@type"
  }]
}