#word,encoding,type,subtype,linga,padi,meaning,context,subcontext,audio_url,image_url
unnataH,Itrans,subanta,,puM,,,general,parimANa,,,
vAmanaH,Itrans,subanta,,puM,,,general,parimANa,,,
mandaH,Itrans,subanta,,puM,,,general,parimANa,,,
yAnam,Itrans,subanta,,napuM,,,general,general,,,
giriH,Itrans,subanta,,puM,,,general,meyam,,,
nadI,Itrans,subanta,,strI,,,general,meyam,,,
bAlakaH,Itrans,subanta,,strI,,,general,meyam,,,
