EESchema Schematic File Version 4
EELAYER 30 0
EELAYER END
$Descr A4 11693 8268
encoding utf-8
Sheet 1 1
Title ""
Date ""
Rev ""
Comp ""
Comment1 ""
Comment2 ""
Comment3 ""
Comment4 ""
$EndDescr
$Comp
L Device:C_Small C4
U 1 1 5E9D534B
P 2300 1250
F 0 "C4" H 2392 1296 50  0000 L CNN
F 1 "10u" H 2392 1205 50  0000 L CNN
F 2 "Capacitor_SMD:C_0805_2012Metric" H 2300 1250 50  0001 C CNN
F 3 "~" H 2300 1250 50  0001 C CNN
	1    2300 1250
	1    0    0    -1  
$EndComp
$Comp
L Device:Fuse_Small F1
U 1 1 5E9D6D3B
P 1100 1000
F 0 "F1" H 1100 1185 50  0000 C CNN
F 1 "500mA" H 1100 1094 50  0000 C CNN
F 2 "Fuse:Fuse_0603_1608Metric" H 1100 1000 50  0001 C CNN
F 3 "~" H 1100 1000 50  0001 C CNN
	1    1100 1000
	1    0    0    -1  
$EndComp
Wire Wire Line
	1600 1000 1550 1000
$Comp
L Device:D_Zener_Small D1
U 1 1 5E9DBDBE
P 750 1000
F 0 "D1" H 750 795 50  0000 C CNN
F 1 "B5819W" H 750 886 50  0000 C CNN
F 2 "Diode_SMD:D_SOD-123" V 750 1000 50  0001 C CNN
F 3 "~" V 750 1000 50  0001 C CNN
	1    750  1000
	-1   0    0    1   
$EndComp
Wire Wire Line
	2300 1000 2300 1150
Wire Wire Line
	1900 1300 1900 1450
Wire Wire Line
	2300 1350 2300 1450
Wire Wire Line
	2300 1450 1900 1450
Connection ~ 1900 1450
$Comp
L power:GND #PWR04
U 1 1 5E9E7128
P 1900 1550
F 0 "#PWR04" H 1900 1300 50  0001 C CNN
F 1 "GND" H 1905 1377 50  0000 C CNN
F 2 "" H 1900 1550 50  0001 C CNN
F 3 "" H 1900 1550 50  0001 C CNN
	1    1900 1550
	1    0    0    -1  
$EndComp
$Comp
L power:VCC #PWR01
U 1 1 5E9E7EEA
P 550 1000
F 0 "#PWR01" H 550 850 50  0001 C CNN
F 1 "VCC" H 567 1173 50  0000 C CNN
F 2 "" H 550 1000 50  0001 C CNN
F 3 "" H 550 1000 50  0001 C CNN
	1    550  1000
	1    0    0    -1  
$EndComp
$Comp
L power:+3V3 #PWR06
U 1 1 5E9EC10B
P 2300 1000
F 0 "#PWR06" H 2300 850 50  0001 C CNN
F 1 "+3V3" H 2315 1173 50  0000 C CNN
F 2 "" H 2300 1000 50  0001 C CNN
F 3 "" H 2300 1000 50  0001 C CNN
	1    2300 1000
	1    0    0    -1  
$EndComp
Connection ~ 2300 1000
Wire Wire Line
	1550 1150 1550 1000
Wire Wire Line
	2200 1000 2300 1000
Wire Wire Line
	1900 1450 1550 1450
$Comp
L Regulator_Linear:AMS1117-3.3 U1
U 1 1 5E9D21E6
P 1900 1000
F 0 "U1" H 1900 1242 50  0000 C CNN
F 1 "AMS1117-3.3" H 1900 1151 50  0000 C CNN
F 2 "Package_TO_SOT_SMD:SOT-223-3_TabPin2" H 1900 1200 50  0001 C CNN
F 3 "http://www.advanced-monolithic.com/pdf/ds1117.pdf" H 2000 750 50  0001 C CNN
	1    1900 1000
	1    0    0    -1  
$EndComp
$Comp
L Device:C_Small C3
U 1 1 5E9D41CD
P 1550 1250
F 0 "C3" H 1642 1296 50  0000 L CNN
F 1 "10u" H 1642 1205 50  0000 L CNN
F 2 "Capacitor_SMD:C_0805_2012Metric" H 1550 1250 50  0001 C CNN
F 3 "~" H 1550 1250 50  0001 C CNN
	1    1550 1250
	1    0    0    -1  
$EndComp
Wire Wire Line
	1550 1450 1550 1350
Wire Notes Line
	500  650  2600 650 
Wire Notes Line
	2600 650  2600 1750
Wire Notes Line
	500  1750 500  650 
Text Notes 600  600  0    50   ~ 0
Voltage regulator 3v3
$Comp
L power:GND #PWR021
U 1 1 5EA090EF
P 5050 4850
F 0 "#PWR021" H 5050 4600 50  0001 C CNN
F 1 "GND" H 5055 4677 50  0000 C CNN
F 2 "" H 5050 4850 50  0001 C CNN
F 3 "" H 5050 4850 50  0001 C CNN
	1    5050 4850
	1    0    0    -1  
$EndComp
$Comp
L Device:C_Small C8
U 1 1 5EA328D5
P 2700 2700
F 0 "C8" H 2792 2746 50  0000 L CNN
F 1 "100n" H 2792 2655 50  0000 L CNN
F 2 "Capacitor_SMD:C_0402_1005Metric" H 2700 2700 50  0001 C CNN
F 3 "~" H 2700 2700 50  0001 C CNN
	1    2700 2700
	1    0    0    -1  
$EndComp
$Comp
L Device:C_Small C9
U 1 1 5EA32DB8
P 2950 2700
F 0 "C9" H 3042 2746 50  0000 L CNN
F 1 "100n" H 3042 2655 50  0000 L CNN
F 2 "Capacitor_SMD:C_0402_1005Metric" H 2950 2700 50  0001 C CNN
F 3 "~" H 2950 2700 50  0001 C CNN
	1    2950 2700
	1    0    0    -1  
$EndComp
$Comp
L Device:C_Small C10
U 1 1 5EA34224
P 3200 2700
F 0 "C10" H 3292 2746 50  0000 L CNN
F 1 "100n" H 3292 2655 50  0000 L CNN
F 2 "Capacitor_SMD:C_0402_1005Metric" H 3200 2700 50  0001 C CNN
F 3 "~" H 3200 2700 50  0001 C CNN
	1    3200 2700
	1    0    0    -1  
$EndComp
$Comp
L Device:C_Small C11
U 1 1 5EA3422A
P 3450 2700
F 0 "C11" H 3542 2746 50  0000 L CNN
F 1 "100n" H 3542 2655 50  0000 L CNN
F 2 "Capacitor_SMD:C_0402_1005Metric" H 3450 2700 50  0001 C CNN
F 3 "~" H 3450 2700 50  0001 C CNN
	1    3450 2700
	1    0    0    -1  
$EndComp
$Comp
L Device:C_Small C12
U 1 1 5EA39EA2
P 3700 2700
F 0 "C12" H 3792 2746 50  0000 L CNN
F 1 "100n" H 3792 2655 50  0000 L CNN
F 2 "Capacitor_SMD:C_0402_1005Metric" H 3700 2700 50  0001 C CNN
F 3 "~" H 3700 2700 50  0001 C CNN
	1    3700 2700
	1    0    0    -1  
$EndComp
$Comp
L Device:C_Small C13
U 1 1 5EA39EA8
P 3950 2700
F 0 "C13" H 4042 2746 50  0000 L CNN
F 1 "100n" H 4042 2655 50  0000 L CNN
F 2 "Capacitor_SMD:C_0402_1005Metric" H 3950 2700 50  0001 C CNN
F 3 "~" H 3950 2700 50  0001 C CNN
	1    3950 2700
	1    0    0    -1  
$EndComp
$Comp
L Device:C_Small C14
U 1 1 5EA39EAE
P 4200 2700
F 0 "C14" H 4292 2746 50  0000 L CNN
F 1 "100n" H 4292 2655 50  0000 L CNN
F 2 "Capacitor_SMD:C_0402_1005Metric" H 4200 2700 50  0001 C CNN
F 3 "~" H 4200 2700 50  0001 C CNN
	1    4200 2700
	1    0    0    -1  
$EndComp
$Comp
L Device:C_Small C15
U 1 1 5EA39EB4
P 4450 2700
F 0 "C15" H 4542 2746 50  0000 L CNN
F 1 "100n" H 4542 2655 50  0000 L CNN
F 2 "Capacitor_SMD:C_0402_1005Metric" H 4450 2700 50  0001 C CNN
F 3 "~" H 4450 2700 50  0001 C CNN
	1    4450 2700
	1    0    0    -1  
$EndComp
Wire Wire Line
	2700 2600 2950 2600
Wire Wire Line
	2950 2600 3200 2600
Connection ~ 2950 2600
Wire Wire Line
	3200 2600 3450 2600
Connection ~ 3200 2600
Wire Wire Line
	3450 2600 3700 2600
Connection ~ 3450 2600
Wire Wire Line
	3700 2600 3950 2600
Connection ~ 3700 2600
Wire Wire Line
	3950 2600 4200 2600
Connection ~ 3950 2600
Wire Wire Line
	4200 2600 4450 2600
Connection ~ 4200 2600
Wire Wire Line
	2700 2800 2950 2800
Wire Wire Line
	2950 2800 3200 2800
Connection ~ 2950 2800
Wire Wire Line
	3200 2800 3450 2800
Connection ~ 3200 2800
Wire Wire Line
	3450 2800 3700 2800
Connection ~ 3450 2800
Wire Wire Line
	3700 2800 3950 2800
Connection ~ 3700 2800
Wire Wire Line
	3950 2800 4200 2800
Connection ~ 3950 2800
Wire Wire Line
	4200 2800 4450 2800
Connection ~ 4200 2800
$Comp
L power:GND #PWR09
U 1 1 5EA44BEC
P 2700 2800
F 0 "#PWR09" H 2700 2550 50  0001 C CNN
F 1 "GND" H 2705 2627 50  0000 C CNN
F 2 "" H 2700 2800 50  0001 C CNN
F 3 "" H 2700 2800 50  0001 C CNN
	1    2700 2800
	1    0    0    -1  
$EndComp
Connection ~ 2700 2800
$Comp
L power:+3V3 #PWR08
U 1 1 5EA45606
P 2700 2600
F 0 "#PWR08" H 2700 2450 50  0001 C CNN
F 1 "+3V3" H 2715 2773 50  0000 C CNN
F 2 "" H 2700 2600 50  0001 C CNN
F 3 "" H 2700 2600 50  0001 C CNN
	1    2700 2600
	1    0    0    -1  
$EndComp
Connection ~ 2700 2600
$Comp
L Device:C_Small C7
U 1 1 5EA45DB8
P 2450 2700
F 0 "C7" H 2542 2746 50  0000 L CNN
F 1 "10u" H 2542 2655 50  0000 L CNN
F 2 "Capacitor_SMD:C_0603_1608Metric" H 2450 2700 50  0001 C CNN
F 3 "~" H 2450 2700 50  0001 C CNN
	1    2450 2700
	1    0    0    -1  
$EndComp
Wire Wire Line
	2450 2600 2700 2600
Wire Wire Line
	2450 2800 2700 2800
Wire Notes Line
	2350 3150 2350 2300
Wire Notes Line
	2350 2300 4750 2300
Text Notes 2450 2250 0    50   ~ 0
Decoupling capacitors for VDD
$Comp
L Device:Ferrite_Bead_Small FB1
U 1 1 5E9D903A
P 1450 1000
F 0 "FB1" V 1213 1000 50  0000 C CNN
F 1 "100 @ 100Mhz" V 1304 1000 50  0000 C CNN
F 2 "Inductor_SMD:L_0805_2012Metric" V 1380 1000 50  0001 C CNN
F 3 "~" H 1450 1000 50  0001 C CNN
	1    1450 1000
	0    1    1    0   
$EndComp
Connection ~ 1550 1000
Wire Wire Line
	1350 1000 1200 1000
Wire Wire Line
	1000 1000 850  1000
Wire Wire Line
	650  1000 550  1000
$Comp
L power:GND #PWR02
U 1 1 5EA1467F
P 1150 2900
F 0 "#PWR02" H 1150 2650 50  0001 C CNN
F 1 "GND" H 1155 2727 50  0000 C CNN
F 2 "" H 1150 2900 50  0001 C CNN
F 3 "" H 1150 2900 50  0001 C CNN
	1    1150 2900
	1    0    0    -1  
$EndComp
Text GLabel 900  2600 0    50   Input ~ 0
HSE_IN
$Comp
L Device:C_Small C1
U 1 1 5EA19251
P 950 2750
F 0 "C1" H 750 2800 50  0000 L CNN
F 1 "12p" H 700 2700 50  0000 L CNN
F 2 "Capacitor_SMD:C_0402_1005Metric" H 950 2750 50  0001 C CNN
F 3 "~" H 950 2750 50  0001 C CNN
	1    950  2750
	1    0    0    -1  
$EndComp
Wire Wire Line
	950  2850 1150 2850
Wire Wire Line
	1150 2900 1150 2850
Connection ~ 1150 2850
Wire Wire Line
	1150 2700 1150 2850
Wire Wire Line
	900  2600 950  2600
Wire Wire Line
	950  2650 950  2600
Connection ~ 950  2600
Wire Wire Line
	1150 2850 1300 2850
Wire Wire Line
	1150 2500 1150 2450
Wire Wire Line
	1150 2450 1300 2450
Wire Wire Line
	950  2600 1050 2600
$Comp
L Device:Crystal_GND24_Small HSE1
U 1 1 5EA132DB
P 1150 2600
F 0 "HSE1" H 900 2900 50  0000 L CNN
F 1 "16MHz" H 850 2800 50  0000 L CNN
F 2 "Crystal:Crystal_SMD_3225-4Pin_3.2x2.5mm" H 1150 2600 50  0001 C CNN
F 3 "~" H 1150 2600 50  0001 C CNN
	1    1150 2600
	1    0    0    -1  
$EndComp
Connection ~ 1300 2850
Wire Wire Line
	1300 2450 1300 2850
Wire Wire Line
	1250 2600 1400 2600
Wire Wire Line
	1300 2850 1400 2850
Connection ~ 1400 2600
Wire Wire Line
	1400 2650 1400 2600
Wire Wire Line
	1450 2600 1400 2600
$Comp
L Device:R_Small R1
U 1 1 5EA20DF0
P 1550 2600
F 0 "R1" V 1354 2600 50  0000 C CNN
F 1 "220" V 1445 2600 50  0000 C CNN
F 2 "Resistor_SMD:R_0402_1005Metric" H 1550 2600 50  0001 C CNN
F 3 "~" H 1550 2600 50  0001 C CNN
	1    1550 2600
	0    1    1    0   
$EndComp
$Comp
L Device:C_Small C2
U 1 1 5EA18C87
P 1400 2750
F 0 "C2" H 1492 2796 50  0000 L CNN
F 1 "12p" H 1492 2705 50  0000 L CNN
F 2 "Capacitor_SMD:C_0402_1005Metric" H 1400 2750 50  0001 C CNN
F 3 "~" H 1400 2750 50  0001 C CNN
	1    1400 2750
	1    0    0    -1  
$EndComp
Text GLabel 1650 2600 2    50   Input ~ 0
HSE_OUT
Wire Notes Line
	1650 2900 1650 2450
Wire Notes Line
	1650 2450 1350 2450
Wire Notes Line
	1350 2450 1350 2900
Wire Notes Line
	1350 2900 1650 2900
Text Notes 1650 3000 2    50   ~ 0
LPF
Wire Notes Line
	550  2200 2100 2200
Wire Notes Line
	2100 2200 2100 3150
Wire Notes Line
	2100 3150 550  3150
Wire Notes Line
	550  3150 550  2200
Text Notes 1250 2150 2    50   ~ 0
External oscillator
$Comp
L Device:R_Small R5
U 1 1 5EA591FC
P 4900 6350
F 0 "R5" H 4959 6396 50  0000 L CNN
F 1 "10k" H 4959 6305 50  0000 L CNN
F 2 "Resistor_SMD:R_0402_1005Metric" H 4900 6350 50  0001 C CNN
F 3 "~" H 4900 6350 50  0001 C CNN
	1    4900 6350
	1    0    0    -1  
$EndComp
$Comp
L Device:R_Small R7
U 1 1 5EA59995
P 5250 6350
F 0 "R7" H 5309 6396 50  0000 L CNN
F 1 "10k" H 5309 6305 50  0000 L CNN
F 2 "Resistor_SMD:R_0402_1005Metric" H 5250 6350 50  0001 C CNN
F 3 "~" H 5250 6350 50  0001 C CNN
	1    5250 6350
	1    0    0    -1  
$EndComp
$Comp
L power:GND #PWR020
U 1 1 5EA59E0A
P 4900 6450
F 0 "#PWR020" H 4900 6200 50  0001 C CNN
F 1 "GND" H 4905 6277 50  0000 C CNN
F 2 "" H 4900 6450 50  0001 C CNN
F 3 "" H 4900 6450 50  0001 C CNN
	1    4900 6450
	1    0    0    -1  
$EndComp
$Comp
L power:GND #PWR023
U 1 1 5EA5A197
P 5250 6450
F 0 "#PWR023" H 5250 6200 50  0001 C CNN
F 1 "GND" H 5255 6277 50  0000 C CNN
F 2 "" H 5250 6450 50  0001 C CNN
F 3 "" H 5250 6450 50  0001 C CNN
	1    5250 6450
	1    0    0    -1  
$EndComp
Text GLabel 5250 6250 1    50   Input ~ 0
BOOT1
Text GLabel 4900 6250 1    50   Input ~ 0
BOOT0
$Comp
L Connector_Generic:Conn_02x05_Odd_Even J1
U 1 1 5EA64F3F
P 3450 1250
F 0 "J1" H 3500 1667 50  0000 C CNN
F 1 "Conn_02x05_Odd_Even" H 3500 1576 50  0000 C CNN
F 2 "Connector_PinSocket_1.27mm:PinSocket_2x05_P1.27mm_Vertical_SMD" H 3450 1250 50  0001 C CNN
F 3 "~" H 3450 1250 50  0001 C CNN
	1    3450 1250
	1    0    0    -1  
$EndComp
$Comp
L power:+3V3 #PWR013
U 1 1 5EA6619F
P 3250 1050
F 0 "#PWR013" H 3250 900 50  0001 C CNN
F 1 "+3V3" V 3265 1178 50  0000 L CNN
F 2 "" H 3250 1050 50  0001 C CNN
F 3 "" H 3250 1050 50  0001 C CNN
	1    3250 1050
	0    -1   -1   0   
$EndComp
$Comp
L power:GND #PWR012
U 1 1 5EA66A49
P 3150 1450
F 0 "#PWR012" H 3150 1200 50  0001 C CNN
F 1 "GND" H 3155 1277 50  0000 C CNN
F 2 "" H 3150 1450 50  0001 C CNN
F 3 "" H 3150 1450 50  0001 C CNN
	1    3150 1450
	1    0    0    -1  
$EndComp
Wire Wire Line
	3250 1450 3150 1450
Wire Wire Line
	3250 1150 3150 1150
Wire Wire Line
	3150 1150 3150 1250
Connection ~ 3150 1450
Wire Wire Line
	3250 1350 3150 1350
Connection ~ 3150 1350
Wire Wire Line
	3150 1350 3150 1450
Wire Wire Line
	3250 1250 3150 1250
Connection ~ 3150 1250
Wire Wire Line
	3150 1250 3150 1350
Text GLabel 3750 1050 2    50   Input ~ 0
SWDIO
Text GLabel 3750 1150 2    50   Input ~ 0
SWCLK
Text GLabel 3750 1250 2    50   Input ~ 0
SWO
Text GLabel 3750 1450 2    50   Input ~ 0
NRST
Wire Notes Line
	4200 1750 4200 700 
Wire Notes Line
	4200 700  2850 700 
Wire Notes Line
	2850 700  2850 1750
Wire Notes Line
	2850 1750 4200 1750
Text Notes 4200 650  2    50   ~ 0
ARM 10 Pin connnector - STLink
$Comp
L Device:LED_Small D2
U 1 1 5EAC84F9
P 2400 1000
F 0 "D2" H 2400 795 50  0000 C CNN
F 1 "Red" H 2400 886 50  0000 C CNN
F 2 "LED_SMD:LED_0603_1608Metric" V 2400 1000 50  0001 C CNN
F 3 "~" V 2400 1000 50  0001 C CNN
	1    2400 1000
	-1   0    0    1   
$EndComp
$Comp
L Device:R_Small R2
U 1 1 5EADA9EC
P 2500 1150
F 0 "R2" H 2559 1196 50  0000 L CNN
F 1 "2k2" H 2559 1105 50  0000 L CNN
F 2 "Resistor_SMD:R_0603_1608Metric" H 2500 1150 50  0001 C CNN
F 3 "~" H 2500 1150 50  0001 C CNN
	1    2500 1150
	1    0    0    -1  
$EndComp
$Comp
L power:GND #PWR07
U 1 1 5EADB17C
P 2500 1250
F 0 "#PWR07" H 2500 1000 50  0001 C CNN
F 1 "GND" H 2505 1077 50  0000 C CNN
F 2 "" H 2500 1250 50  0001 C CNN
F 3 "" H 2500 1250 50  0001 C CNN
	1    2500 1250
	1    0    0    -1  
$EndComp
Wire Wire Line
	2500 1050 2500 1000
$Comp
L power:+3.3VA #PWR024
U 1 1 5EA0CBAE
P 5500 4350
F 0 "#PWR024" H 5500 4200 50  0001 C CNN
F 1 "+3.3VA" H 5515 4523 50  0000 C CNN
F 2 "" H 5500 4350 50  0001 C CNN
F 3 "" H 5500 4350 50  0001 C CNN
	1    5500 4350
	1    0    0    -1  
$EndComp
Connection ~ 5500 4450
Wire Wire Line
	5500 4350 5500 4450
$Comp
L power:GND #PWR025
U 1 1 5EA09A15
P 5500 4750
F 0 "#PWR025" H 5500 4500 50  0001 C CNN
F 1 "GND" H 5505 4577 50  0000 C CNN
F 2 "" H 5500 4750 50  0001 C CNN
F 3 "" H 5500 4750 50  0001 C CNN
	1    5500 4750
	1    0    0    -1  
$EndComp
Wire Wire Line
	5050 4750 5050 4850
Connection ~ 5050 4450
Wire Wire Line
	5500 4450 5050 4450
Wire Wire Line
	5500 4550 5500 4450
Wire Wire Line
	5050 4450 5050 4550
Wire Wire Line
	5000 4450 5050 4450
$Comp
L Device:C_Small C17
U 1 1 5EA0832B
P 5500 4650
F 0 "C17" H 5592 4696 50  0000 L CNN
F 1 "10n" H 5592 4605 50  0000 L CNN
F 2 "Capacitor_SMD:C_0402_1005Metric" H 5500 4650 50  0001 C CNN
F 3 "~" H 5500 4650 50  0001 C CNN
	1    5500 4650
	1    0    0    -1  
$EndComp
$Comp
L Device:C_Small C16
U 1 1 5EA07D35
P 5050 4650
F 0 "C16" H 5142 4696 50  0000 L CNN
F 1 "100n" H 5142 4605 50  0000 L CNN
F 2 "Capacitor_SMD:C_0402_1005Metric" H 5050 4650 50  0001 C CNN
F 3 "~" H 5050 4650 50  0001 C CNN
	1    5050 4650
	1    0    0    -1  
$EndComp
Wire Wire Line
	4450 4450 4800 4450
$Comp
L power:+3V3 #PWR016
U 1 1 5EA07565
P 4450 4450
F 0 "#PWR016" H 4450 4300 50  0001 C CNN
F 1 "+3V3" H 4465 4623 50  0000 C CNN
F 2 "" H 4450 4450 50  0001 C CNN
F 3 "" H 4450 4450 50  0001 C CNN
	1    4450 4450
	1    0    0    -1  
$EndComp
$Comp
L Device:Ferrite_Bead_Small FB2
U 1 1 5EA05CB4
P 4900 4450
F 0 "FB2" V 4663 4450 50  0000 C CNN
F 1 "100 @ 100Mhz" V 4754 4450 50  0000 C CNN
F 2 "Inductor_SMD:L_0805_2012Metric" V 4830 4450 50  0001 C CNN
F 3 "~" H 4900 4450 50  0001 C CNN
	1    4900 4450
	0    1    1    0   
$EndComp
Wire Notes Line
	2600 1750 500  1750
$Comp
L Device:R_Small R3
U 1 1 5EA82088
P 4250 7050
F 0 "R3" H 4309 7096 50  0000 L CNN
F 1 "2k2" H 4309 7005 50  0000 L CNN
F 2 "Resistor_SMD:R_0603_1608Metric" H 4250 7050 50  0001 C CNN
F 3 "~" H 4250 7050 50  0001 C CNN
	1    4250 7050
	1    0    0    -1  
$EndComp
Wire Wire Line
	4250 6950 4250 6850
$Comp
L power:GND #PWR015
U 1 1 5EA86ED6
P 4250 7150
F 0 "#PWR015" H 4250 6900 50  0001 C CNN
F 1 "GND" H 4255 6977 50  0000 C CNN
F 2 "" H 4250 7150 50  0001 C CNN
F 3 "" H 4250 7150 50  0001 C CNN
	1    4250 7150
	1    0    0    -1  
$EndComp
$Comp
L power:GND #PWR03
U 1 1 5EA0AA32
P 1700 4750
F 0 "#PWR03" H 1700 4500 50  0001 C CNN
F 1 "GND" H 1705 4577 50  0000 C CNN
F 2 "" H 1700 4750 50  0001 C CNN
F 3 "" H 1700 4750 50  0001 C CNN
	1    1700 4750
	1    0    0    -1  
$EndComp
Wire Wire Line
	1700 4350 1700 4550
$Comp
L Device:C_Small C5
U 1 1 5EA4EA1D
P 1700 4650
F 0 "C5" H 1792 4696 50  0000 L CNN
F 1 "2.2u" H 1792 4605 50  0000 L CNN
F 2 "Capacitor_SMD:C_0603_1608Metric" H 1700 4650 50  0001 C CNN
F 3 "~" H 1700 4650 50  0001 C CNN
	1    1700 4650
	1    0    0    -1  
$EndComp
Wire Notes Line
	4750 2300 4750 3150
$Comp
L power:+3V3 #PWR010
U 1 1 5E9FF6AB
P 2800 3500
F 0 "#PWR010" H 2800 3350 50  0001 C CNN
F 1 "+3V3" H 2815 3673 50  0000 C CNN
F 2 "" H 2800 3500 50  0001 C CNN
F 3 "" H 2800 3500 50  0001 C CNN
	1    2800 3500
	1    0    0    -1  
$EndComp
Wire Wire Line
	2800 3500 2800 3650
Wire Wire Line
	2800 3650 2900 3650
Connection ~ 2800 3650
Wire Wire Line
	2800 3650 2800 3750
Wire Wire Line
	3100 3750 3100 3650
Connection ~ 3100 3650
Wire Wire Line
	3100 3650 3200 3650
Wire Wire Line
	3200 3750 3200 3650
Wire Wire Line
	3000 3750 3000 3650
Connection ~ 3000 3650
Wire Wire Line
	3000 3650 3100 3650
Wire Wire Line
	2900 3750 2900 3650
Connection ~ 2900 3650
Wire Wire Line
	2900 3650 3000 3650
$Comp
L power:+3.3VA #PWR014
U 1 1 5EA0F8EA
P 3300 3700
F 0 "#PWR014" H 3300 3550 50  0001 C CNN
F 1 "+3.3VA" H 3300 3850 50  0000 C CNN
F 2 "" H 3300 3700 50  0001 C CNN
F 3 "" H 3300 3700 50  0001 C CNN
	1    3300 3700
	1    0    0    -1  
$EndComp
Wire Wire Line
	3300 3750 3300 3700
$Comp
L power:GND #PWR011
U 1 1 5EA114A7
P 2900 7400
F 0 "#PWR011" H 2900 7150 50  0001 C CNN
F 1 "GND" H 2905 7227 50  0000 C CNN
F 2 "" H 2900 7400 50  0001 C CNN
F 3 "" H 2900 7400 50  0001 C CNN
	1    2900 7400
	1    0    0    -1  
$EndComp
Wire Wire Line
	2900 7350 2900 7400
Wire Wire Line
	3100 7350 3100 7400
Wire Wire Line
	3100 7400 3000 7400
Connection ~ 2900 7400
Wire Wire Line
	3000 7350 3000 7400
Connection ~ 3000 7400
Wire Wire Line
	3000 7400 2900 7400
$Comp
L Device:C_Small C6
U 1 1 5EA4DA11
P 2050 4650
F 0 "C6" H 2142 4696 50  0000 L CNN
F 1 "2.2u" H 2142 4605 50  0000 L CNN
F 2 "Capacitor_SMD:C_0603_1608Metric" H 2050 4650 50  0001 C CNN
F 3 "~" H 2050 4650 50  0001 C CNN
	1    2050 4650
	1    0    0    -1  
$EndComp
Wire Wire Line
	2300 4450 2050 4450
Wire Wire Line
	2050 4450 2050 4550
Wire Wire Line
	2300 4350 1700 4350
Text GLabel 2150 3950 0    50   Input ~ 0
NRST
Wire Wire Line
	2150 3950 2300 3950
$Comp
L power:GND #PWR05
U 1 1 5EA0A2F6
P 2050 4750
F 0 "#PWR05" H 2050 4500 50  0001 C CNN
F 1 "GND" H 2055 4577 50  0000 C CNN
F 2 "" H 2050 4750 50  0001 C CNN
F 3 "" H 2050 4750 50  0001 C CNN
	1    2050 4750
	1    0    0    -1  
$EndComp
Text GLabel 2150 4150 0    50   Input ~ 0
BOOT0
Wire Wire Line
	2150 4150 2300 4150
Text GLabel 3700 5850 2    50   Input ~ 0
BOOT1
Text GLabel 2300 5150 0    50   Input ~ 0
HSE_IN
Text GLabel 2300 5250 0    50   Input ~ 0
HSE_OUT
Text GLabel 3700 5250 2    50   Input ~ 0
SWDIO
Text GLabel 3700 5350 2    50   Input ~ 0
SWCLK
Text GLabel 3700 5950 2    50   Input ~ 0
SWO
Text GLabel 3700 6250 2    50   Input ~ 0
I2C1_SCL
Text GLabel 3700 4850 2    50   Input ~ 0
USART1_TX
Text GLabel 3700 4950 2    50   Input ~ 0
USART1_RX
Text GLabel 3700 4350 2    50   Input ~ 0
SPI1_CS
Text GLabel 3700 4450 2    50   Input ~ 0
SPI1_SCK
Text GLabel 3700 4550 2    50   Input ~ 0
SPI1_MISO
Text GLabel 4150 4650 2    50   Input ~ 0
SPI1_MOSI
$Comp
L Device:LED_Small D3
U 1 1 5EA7C89D
P 4000 6850
F 0 "D3" H 4000 6645 50  0000 C CNN
F 1 "Red" H 4000 6736 50  0000 C CNN
F 2 "LED_SMD:LED_0603_1608Metric" V 4000 6850 50  0001 C CNN
F 3 "~" V 4000 6850 50  0001 C CNN
	1    4000 6850
	-1   0    0    1   
$EndComp
Wire Wire Line
	3700 6850 3900 6850
NoConn ~ 3700 4050
NoConn ~ 3700 3950
NoConn ~ 3700 4150
NoConn ~ 3700 4250
NoConn ~ 3700 4750
NoConn ~ 3700 5050
NoConn ~ 3700 5150
NoConn ~ 3700 5450
NoConn ~ 3700 5650
NoConn ~ 3700 5750
NoConn ~ 3700 6050
NoConn ~ 3700 6150
NoConn ~ 3700 6450
NoConn ~ 3700 6550
NoConn ~ 3700 6650
NoConn ~ 3700 6750
NoConn ~ 3700 7050
NoConn ~ 3700 7150
NoConn ~ 3700 6950
NoConn ~ 2300 7150
NoConn ~ 2300 7050
NoConn ~ 2300 6950
NoConn ~ 2300 6850
NoConn ~ 2300 6750
NoConn ~ 2300 6550
NoConn ~ 2300 6650
NoConn ~ 2300 6450
Wire Wire Line
	4250 6850 4100 6850
NoConn ~ 2300 6350
NoConn ~ 2300 6250
NoConn ~ 2300 6150
NoConn ~ 2300 6050
NoConn ~ 2300 5950
NoConn ~ 2300 5850
NoConn ~ 2300 5750
NoConn ~ 2300 5650
NoConn ~ 2300 5450
Wire Notes Line
	4750 3150 2350 3150
Wire Notes Line
	6150 7700 6150 2050
Wire Notes Line
	6150 2050 500  2050
Wire Notes Line
	500  2050 500  7700
Wire Notes Line
	500  7700 6150 7700
Text Notes 1650 2000 2    89   ~ 0
Microcontroller
$Comp
L Connector_Generic:Conn_01x02 J3
U 1 1 5EC6443A
P 5050 1500
F 0 "J3" H 5130 1492 50  0000 L CNN
F 1 "Conn_01x02" H 5130 1401 50  0000 L CNN
F 2 "Connector_PinHeader_2.54mm:PinHeader_1x02_P2.54mm_Vertical" H 5050 1500 50  0001 C CNN
F 3 "~" H 5050 1500 50  0001 C CNN
	1    5050 1500
	1    0    0    -1  
$EndComp
$Comp
L Connector_Generic:Conn_01x02 J5
U 1 1 5EC685BB
P 6250 1500
F 0 "J5" H 6330 1492 50  0000 L CNN
F 1 "Conn_01x02" H 6330 1401 50  0000 L CNN
F 2 "Connector_PinHeader_2.54mm:PinHeader_1x02_P2.54mm_Vertical" H 6250 1500 50  0001 C CNN
F 3 "~" H 6250 1500 50  0001 C CNN
	1    6250 1500
	1    0    0    -1  
$EndComp
Text GLabel 4900 5500 3    50   Input ~ 0
I2C1_SCL
Text GLabel 3700 6350 2    50   Input ~ 0
I2C1_SDA
Text GLabel 5250 5500 3    50   Input ~ 0
I2C1_SDA
$Comp
L Device:R_Small R4
U 1 1 5EC6A498
P 4900 5400
F 0 "R4" H 4959 5446 50  0000 L CNN
F 1 "2k2" H 4959 5355 50  0000 L CNN
F 2 "Resistor_SMD:R_0402_1005Metric" H 4900 5400 50  0001 C CNN
F 3 "~" H 4900 5400 50  0001 C CNN
	1    4900 5400
	1    0    0    -1  
$EndComp
$Comp
L Device:R_Small R6
U 1 1 5EC6A980
P 5250 5400
F 0 "R6" H 5309 5446 50  0000 L CNN
F 1 "2k2" H 5309 5355 50  0000 L CNN
F 2 "Resistor_SMD:R_0402_1005Metric" H 5250 5400 50  0001 C CNN
F 3 "~" H 5250 5400 50  0001 C CNN
	1    5250 5400
	1    0    0    -1  
$EndComp
$Comp
L power:+3V3 #PWR019
U 1 1 5EC6AC3C
P 4900 5300
F 0 "#PWR019" H 4900 5150 50  0001 C CNN
F 1 "+3V3" H 4915 5473 50  0000 C CNN
F 2 "" H 4900 5300 50  0001 C CNN
F 3 "" H 4900 5300 50  0001 C CNN
	1    4900 5300
	1    0    0    -1  
$EndComp
$Comp
L power:+3V3 #PWR022
U 1 1 5EC6B054
P 5250 5300
F 0 "#PWR022" H 5250 5150 50  0001 C CNN
F 1 "+3V3" H 5265 5473 50  0000 C CNN
F 2 "" H 5250 5300 50  0001 C CNN
F 3 "" H 5250 5300 50  0001 C CNN
	1    5250 5300
	1    0    0    -1  
$EndComp
$Comp
L Connector_Generic:Conn_01x04 J6
U 1 1 5EC6D386
P 7450 1050
F 0 "J6" H 7530 1042 50  0000 L CNN
F 1 "Conn_01x04" H 7530 951 50  0000 L CNN
F 2 "Connector_PinSocket_2.54mm:PinSocket_1x04_P2.54mm_Vertical" H 7450 1050 50  0001 C CNN
F 3 "~" H 7450 1050 50  0001 C CNN
	1    7450 1050
	1    0    0    -1  
$EndComp
Text GLabel 4850 1500 0    50   Input ~ 0
USART1_TX
Text GLabel 4850 1600 0    50   Input ~ 0
USART1_RX
Text GLabel 6050 1500 0    50   Input ~ 0
I2C1_SCL
Text GLabel 6050 1600 0    50   Input ~ 0
I2C1_SDA
Text GLabel 7250 950  0    50   Input ~ 0
SPI1_CS
Text GLabel 7250 1050 0    50   Input ~ 0
SPI1_SCK
Text GLabel 7250 1150 0    50   Input ~ 0
SPI1_MISO
Text GLabel 7250 1250 0    50   Input ~ 0
SPI1_MOSI
$Comp
L Connector_Generic:Conn_01x02 J4
U 1 1 5EC77D9E
P 5900 900
F 0 "J4" H 5980 892 50  0000 L CNN
F 1 "Conn_01x02" H 5980 801 50  0000 L CNN
F 2 "Connector_PinHeader_2.54mm:PinHeader_1x02_P2.54mm_Vertical" H 5900 900 50  0001 C CNN
F 3 "~" H 5900 900 50  0001 C CNN
	1    5900 900 
	1    0    0    -1  
$EndComp
$Comp
L power:VCC #PWR026
U 1 1 5EC78580
P 5650 900
F 0 "#PWR026" H 5650 750 50  0001 C CNN
F 1 "VCC" H 5667 1073 50  0000 C CNN
F 2 "" H 5650 900 50  0001 C CNN
F 3 "" H 5650 900 50  0001 C CNN
	1    5650 900 
	1    0    0    -1  
$EndComp
$Comp
L power:GND #PWR027
U 1 1 5EC78F29
P 5700 1000
F 0 "#PWR027" H 5700 750 50  0001 C CNN
F 1 "GND" H 5705 827 50  0000 C CNN
F 2 "" H 5700 1000 50  0001 C CNN
F 3 "" H 5700 1000 50  0001 C CNN
	1    5700 1000
	1    0    0    -1  
$EndComp
$Comp
L Connector_Generic:Conn_01x02 J2
U 1 1 5EC7A1EA
P 4850 900
F 0 "J2" H 4930 892 50  0000 L CNN
F 1 "Conn_01x02" H 4930 801 50  0000 L CNN
F 2 "Connector_PinHeader_2.54mm:PinHeader_1x02_P2.54mm_Vertical" H 4850 900 50  0001 C CNN
F 3 "~" H 4850 900 50  0001 C CNN
	1    4850 900 
	1    0    0    -1  
$EndComp
$Comp
L power:+3V3 #PWR017
U 1 1 5EC7B2CE
P 4650 900
F 0 "#PWR017" H 4650 750 50  0001 C CNN
F 1 "+3V3" H 4665 1073 50  0000 C CNN
F 2 "" H 4650 900 50  0001 C CNN
F 3 "" H 4650 900 50  0001 C CNN
	1    4650 900 
	1    0    0    -1  
$EndComp
$Comp
L power:GND #PWR018
U 1 1 5EC7BAB2
P 4650 1000
F 0 "#PWR018" H 4650 750 50  0001 C CNN
F 1 "GND" H 4655 827 50  0000 C CNN
F 2 "" H 4650 1000 50  0001 C CNN
F 3 "" H 4650 1000 50  0001 C CNN
	1    4650 1000
	1    0    0    -1  
$EndComp
Wire Notes Line
	2750 550  2750 1950
Wire Notes Line
	2750 1950 8050 1950
Wire Notes Line
	8050 1950 8050 550 
Wire Notes Line
	8050 550  2750 550 
Text Notes 7600 2100 2    89   ~ 0
Connectors
$Comp
L Mechanical:MountingHole_Pad H1
U 1 1 5ECD3098
P 6900 2650
F 0 "H1" V 6854 2800 50  0000 L CNN
F 1 "MountingHole_Pad" V 6945 2800 50  0000 L CNN
F 2 "MountingHole:MountingHole_4.3mm_M4_Pad_Via" H 6900 2650 50  0001 C CNN
F 3 "~" H 6900 2650 50  0001 C CNN
	1    6900 2650
	0    1    1    0   
$EndComp
$Comp
L Mechanical:MountingHole_Pad H2
U 1 1 5ECD46E7
P 6900 2900
F 0 "H2" V 6854 3050 50  0000 L CNN
F 1 "MountingHole_Pad" V 6945 3050 50  0000 L CNN
F 2 "MountingHole:MountingHole_4.3mm_M4_Pad_Via" H 6900 2900 50  0001 C CNN
F 3 "~" H 6900 2900 50  0001 C CNN
	1    6900 2900
	0    1    1    0   
$EndComp
$Comp
L Mechanical:MountingHole_Pad H3
U 1 1 5ECD4907
P 6900 3150
F 0 "H3" V 6854 3300 50  0000 L CNN
F 1 "MountingHole_Pad" V 6945 3300 50  0000 L CNN
F 2 "MountingHole:MountingHole_4.3mm_M4_Pad_Via" H 6900 3150 50  0001 C CNN
F 3 "~" H 6900 3150 50  0001 C CNN
	1    6900 3150
	0    1    1    0   
$EndComp
$Comp
L Mechanical:MountingHole_Pad H4
U 1 1 5ECD4A86
P 6900 3400
F 0 "H4" V 6854 3550 50  0000 L CNN
F 1 "MountingHole_Pad" V 6945 3550 50  0000 L CNN
F 2 "MountingHole:MountingHole_4.3mm_M4_Pad_Via" H 6900 3400 50  0001 C CNN
F 3 "~" H 6900 3400 50  0001 C CNN
	1    6900 3400
	0    1    1    0   
$EndComp
$Comp
L power:GND #PWR028
U 1 1 5ECD50BC
P 6600 3400
F 0 "#PWR028" H 6600 3150 50  0001 C CNN
F 1 "GND" H 6605 3227 50  0000 C CNN
F 2 "" H 6600 3400 50  0001 C CNN
F 3 "" H 6600 3400 50  0001 C CNN
	1    6600 3400
	1    0    0    -1  
$EndComp
Wire Wire Line
	6600 3400 6800 3400
Wire Wire Line
	6600 3400 6600 3150
Wire Wire Line
	6600 3150 6800 3150
Connection ~ 6600 3400
Wire Wire Line
	6800 2900 6600 2900
Wire Wire Line
	6600 2900 6600 3150
Connection ~ 6600 3150
Wire Wire Line
	6800 2650 6600 2650
Wire Wire Line
	6600 2650 6600 2900
Connection ~ 6600 2900
Wire Notes Line
	6400 2450 6400 3750
Wire Notes Line
	6400 3750 7850 3750
Wire Notes Line
	7850 3750 7850 2450
Wire Notes Line
	7850 2450 6400 2450
Text Notes 7000 2400 2    50   ~ 0
Mounting holes
Wire Wire Line
	5650 900  5700 900 
NoConn ~ 3750 1350
Wire Wire Line
	1900 1550 1900 1450
$Comp
L MCU_ST_STM32F4:STM32F405RGTx U2
U 1 1 5E9CF66D
P 3000 5550
F 0 "U2" H 3000 3661 50  0000 C CNN
F 1 "STM32F405RGTx" H 3000 3570 50  0000 C CNN
F 2 "Package_QFP:LQFP-64_10x10mm_P0.5mm" H 2400 3850 50  0001 R CNN
F 3 "http://www.st.com/st-web-ui/static/active/en/resource/technical/document/datasheet/DM00037051.pdf" H 3000 5550 50  0001 C CNN
	1    3000 5550
	1    0    0    -1  
$EndComp
$EndSCHEMATC
