<svg xmlns="http://www.w3.org/2000/svg" viewBox="0 0 40 40">
                        <g id="Layer_2" data-name="Layer 2">
                            <g id="background">
                                <path fill="#f9d606" d="M40,20A20,20,0,1,1,20,0,20,20,0,0,1,40,20Z"></path>
                                <path d="M23.67,15.91c0,1.2-1.88,3.34-3.56,4.85L20,20.68l-.08.08c-1.68-1.5-3.56-3.65-3.56-4.85a3.64,3.64,0,0,1,7.27,0Zm4.12,12.54L22,22.7c1.68-1.52,4.35-4.31,4.35-6.79a6.36,6.36,0,1,0-12.71,0c0,2.48,2.67,5.27,4.34,6.79l-5.81,5.81,1.93,1.93,5.9-5.9,5.83,5.83Z"></path>
                            </g>
                        </g>
                    </svg>