<?xml version="1.0" encoding="utf-8"?>
<!-- Generator: Adobe Illustrator 23.0.1, SVG Export Plug-In . SVG Version: 6.00 Build 0)  -->
<svg version="1.1" id="Слой_1" xmlns="http://www.w3.org/2000/svg" xmlns:xlink="http://www.w3.org/1999/xlink" x="0px" y="0px"
	 width="292.700592px" height="156.1575775px" viewBox="0 0 292.700592 156.1575775"
	 style="enable-background:new 0 0 292.700592 156.1575775;" xml:space="preserve">
<path d="M151.2375488,9.530942v137.7728729h138.0125732V9.530942H151.2375488z M249.8350677,116.5146408h-59.1824646v-16.053566
	h20.6059723v-36.899086c-3.3543854,5.9901276-11.2614594,8.1464844-20.6059723,8.6257248V54.2173347
	c11.9802551-1.4375725,19.647644-8.3861732,22.2832336-17.2515907h17.0119019v63.7350235h19.8873291V116.5146408z"/>
<path d="M78.1927185,3.4210436c-10.3548279,0-20.2195129,2.0985639-29.1919518,5.8935871
	s-17.0526257,9.2865028-23.8384609,16.0723381S12.8849897,40.2529945,9.0899677,49.2254295
	S3.1963809,68.0625534,3.1963809,78.4173813s2.0985639,20.2195206,5.8935871,29.1919556s9.2865028,17.0526276,16.0723381,23.8384628
	c6.7858353,6.7858276,14.8660259,12.2773132,23.8384609,16.0723419c8.9724388,3.7950134,18.8371239,5.8935852,29.1919518,5.8935852
	s20.2195206-2.0985718,29.1919556-5.8935852c8.972435-3.7950287,17.0526276-9.2865143,23.8384552-16.0723419
	c6.7858429-6.7858353,12.2773285-14.8660278,16.0723419-23.8384628c3.7950287-8.972435,5.8935852-18.8371277,5.8935852-29.1919556
	s-2.0985565-20.2195129-5.8935852-29.1919518c-3.7950134-8.972435-9.286499-17.0526237-16.0723419-23.8384609
	c-6.7858276-6.7858353-14.8660202-12.2773161-23.8384552-16.0723381S88.5475464,3.4210436,78.1927185,3.4210436z
	 M112.8156738,87.6421204h-6.349556h-6.349556h-6.3495483h-6.349556v6.4693222v6.4693298v6.4693298v6.4693298h-4.6124039h-4.6124039
	H73.580246h-4.6124039v-6.4693298v-6.4693298v-6.4693298v-6.4693222h-6.3495216h-6.3495178h-6.3495178H43.569767v-4.6722946
	v-4.672287v-4.6722946v-4.672287h6.3495178h6.3495178h6.3495178h6.3495216v-6.4094429v-6.4094391v-6.4094429v-6.4094429h4.6124039
	h4.6124039h4.6124039h4.6124039v6.4693298v6.469326v6.4693298v6.4693298h6.349556h6.3495483h6.349556h6.349556v4.6124039v4.6124039
	v4.6124039V87.6421204z"/>
</svg>
