<?xml version="1.0" standalone="no"?>
<!DOCTYPE svg PUBLIC "-//W3C//DTD SVG 1.1//EN" "http://www.w3.org/Graphics/SVG/1.1/DTD/svg11.dtd" >
<svg xmlns="http://www.w3.org/2000/svg">
<metadata>Generated by IcoMoon</metadata>
<defs>
<font id="icomoon" horiz-adv-x="1024">
<font-face units-per-em="1024" ascent="960" descent="-64" />
<missing-glyph horiz-adv-x="1024" />
<glyph unicode="&#x20;" horiz-adv-x="512" d="" />
<glyph unicode="&#xe900;" glyph-name="economy" horiz-adv-x="764" d="M695.358 648.057c0.213 4.308 0.334 9.355 0.334 14.431 0 172.281-139.661 311.943-311.943 311.943s-311.943-139.661-311.943-311.943c0-5.076 0.121-10.123 0.361-15.139-0.027-120.863 133.567-257.797 213.056-333.278l-285.224-283.22 94.184-94.184 289.232 288.564 284.556-285.892 94.184 94.184-279.88 282.552c82.16 73.477 213.083 210.411 213.083 331.982zM387.423 410.26l-4.008 4.008-4.008-4.008c-81.492 74.145-173.673 179.016-173.673 237.798-0.213 3.262-0.334 7.071-0.334 10.91 0 98.499 79.849 178.348 178.348 178.348s178.348-79.849 178.348-178.348c0-3.838-0.121-7.648-0.36-11.426 0.026-58.265-94.158-163.137-174.314-237.281z" />
<glyph unicode="&#xe901;" glyph-name="eco" horiz-adv-x="2167" d="M1654.154 960c-197.494 0-439.509-213.476-570.792-342.475-131.282 132.424-373.298 342.475-570.792 342.475-283.716 0-513.712-229.997-513.712-513.712s229.997-513.712 513.712-513.712c197.494 0 439.509 213.476 570.792 342.475 131.282-132.424 373.298-342.475 570.792-342.475 283.716 0 513.712 229.997 513.712 513.712s-229.997 513.712-513.712 513.712zM512.571 160.892c-157.62 0-285.396 127.776-285.396 285.396s127.776 285.396 285.396 285.396c172.379 0 280.829-149.547 414.395-283.113-133.565-134.707-253.431-287.679-415.536-287.679zM1654.154 160.892c-157.538 0-284.254 152.972-414.395 287.679 130.14 133.565 276.263 283.113 414.395 283.113 157.62 0 285.396-127.776 285.396-285.396s-127.776-285.396-285.396-285.396z" />
<glyph unicode="&#xe902;" glyph-name="community" horiz-adv-x="1915" d="M1914.656 814.441l-145.559 145.559-732.883-732.883-526.25 526.25-509.964-509.964 145.559-145.559 364.406 364.406 526.25-526.25 878.441 878.441z" />
</font></defs></svg>