<!-- Generator: Adobe Illustrator 21.1.0, SVG Export Plug-In  -->
<svg version="1.1"
	 xmlns="http://www.w3.org/2000/svg" xmlns:xlink="http://www.w3.org/1999/xlink" xmlns:a="http://ns.adobe.com/AdobeSVGViewerExtensions/3.0/"
	 x="0px" y="0px" width="136.4px" height="130.3px" viewBox="0 0 136.4 130.3" style="enable-background:new 0 0 136.4 130.3;"
	 xml:space="preserve">
<style type="text/css">
	.st0{fill:none;stroke:#000000;stroke-width:8.3477;stroke-linecap:round;stroke-linejoin:round;stroke-miterlimit:10;}
	.st1{fill:none;stroke:#000000;stroke-width:8.3477;stroke-miterlimit:10;}
</style>
<defs>
</defs>
<g>
	<path class="st0" d="M27.6,85.4l5.2-1.5c8.4-3.4,17.5-4.4,26.4-3l29.7,4.6c2.6,0.4,4.8,2.2,5.6,4.7l0,0c1.5,4.3-2,9.5-6.6,9.9
		l-34.3-2l44.4,2.6c3.5,0.2,7.1-0.2,10.5-1.3l14.1-4.6c3.8-1.3,7.9,0.8,9.1,4.7v0c1.2,3.7-0.7,7.6-4.4,9l-34.7,13
		c-6.9,2.6-14.5,3-21.7,1.2l-46.6-12.1"/>
	<path class="st1" d="M0,70.9h26c1.6,0,2.9,1.4,2.7,3l-6,48.2c-0.3,2.3-2.2,4-4.5,4H0"/>
	<path class="st1" d="M75.7,50C75.7,39.4,94,7,95.6,4.2c0-0.1,0.2-0.1,0.2,0C97.4,7,115.7,39.4,115.7,50c0,11-9,20-20,20
		S75.7,61.1,75.7,50z"/>
</g>
</svg>
