<?xml version="1.0" encoding="utf-8"?>
<!-- Generator: Adobe Illustrator 23.1.1, SVG Export Plug-In . SVG Version: 6.00 Build 0)  -->
<svg version="1.1" id="Layer_1" xmlns="http://www.w3.org/2000/svg" xmlns:xlink="http://www.w3.org/1999/xlink" x="0px" y="0px"
	 viewBox="0 0 13 7.9" style="enable-background:new 0 0 13 7.9;" xml:space="preserve">
<polygon points="6.5,7.9 0,1.4 1.4,0 6.5,5.1 11.5,0 13,1.4 "/>
</svg>
