{
  "solicitud": {
    "documentoAra": "IM-020", // parametrica: {IM-020+IBMETRO}
    "solicitudCorrelativo": "B12345",
    "solicitudFecha": "2024-05-27",
    "solicitudTipo": "Certificado de Importacion", // parametrica: cartilla AP, DJ, CC
    "institucionEmisoraId": 1, // parametrica: INSTITUCIONES
    "institucionEmisoraName": "IBMETRO", // parametrica: INSTITUCIONES
    "itemsCantidadTotal": 2,
    "itemsPesoTotal": 0,
    "solicitante": {
      "documentoTipo": "CI",
      "documentoNro": "234234",
      "nombres": "Carlos Porez",
      "primerAp": "Carlos Perez",
      "segundoAp": "Carlos Perez", // analisar ap cazada
      "contactoCelular": "+591-2-6543210",
      "contactoEmail": "carlos.perez@importacionesperez.bo",
      "operadorTipo": "1", // 1: imp, exp, ada, trn, etc... (OCE)
      "empresa": {
          "nit": "sdfsdf",
          "razonSocial": "sdlfsldf",
          "contactoEmail": "sdlfsldf"
      },
      "agenciaDespachante": {
          "nit": "sldfjsldf",
          "razonSocial": "jdlfksdf",
          "contactoEmail": "sdlfsldf"
      }
    },
    "adjunto": [ // INSTITUCION+IM-20: [DOC_ADJ] EJ: {CI, ORIGEN}
      {
        "archivoReferencia": "taller_inspeccion_refrigerante.pdf", // pdf cargado a minio
        "codigo": "COD_ADJ_001",
        "origen": "VUCE", // DONDE ESTA EL DOCUMENTO
        "metaData": {
          "taller": "",
          "fecha": "",
          "informeCod": ""
        }
      },
      {
        "archivoReferencia": "taller_control_emision_gases.pdf", // pdf cargado a minio
        "codigo": "COD_ADJ_001",
        "origen": "VUCE", // DONDE ESTA EL DOCUMENTO
        "metaData": {
          "taller": "",
          "fecha": "",
          "informeCod": ""
        }
      }
    ],
    "body_header": {},
    "body_item": [
      {
        "prm": "V001",
        "nroChasis": "V001",
        "chasisVin": "V001",
        "clase": "V001",
        "marca": "Toyota",
        "tipo": "Toyota",
        "modelo": "Corolla",
        "combustible": "Corolla",
        "paisOrigen": "Corolla",
        "refrigerante": "Corolla"
      }
    ],
    "detallePago": [ // IM-020: TIPOS_PAGOS
      {
          "codigoPago": "PA-001",
          "nit": "1023456789",
          "razonSocial": "Importaciones Pérez SA",
          "montoTotal": 38000,
          "moneda": "BS"
      }
    ],
    "estadoSolicitud": {
      "estadoActual": "Pendiente",
      "fechaActualizacion": "2024-05-27T10:00:00Z",
      "observaciones": "Solicitud en proceso de revisión."
    }
  }
}

