{
  "type": "service_account",
  "project_id": "notification-service-ee07d",
  "private_key_id": "1b9a2ca039c8fc20f166e49eaaed92297a515f05",
  "private_key": "-----BEGIN PRIVATE KEY-----\nMIIEvwIBADANBgkqhkiG9w0BAQEFAASCBKkwggSlAgEAAoIBAQDgGLanTkBd/hhT\nf3bZPJ2e0bFQpdt6HsVaGDxzOqIeJvVKd1bdwVQY2VWzAnggTtWC1dqUk13ygDAb\n+a0kJvghX78MQniHeFjxivFD5IB1nlGAefqsGJ+1x622fwGUWX0eQ1QpU73AWaNB\n+BvGEfmLriV0ZfVUOPDBjgANSHg6GPTBda1F+qNv7QXtej5uqTZ4UdSKe+DOF3Cf\n2g0sJ9sy2BKTIa1qlvVKO/CdeouBBeizgtGXFYha8Jdvxtyw76pxySX3Vfox1aOB\nThgK2j5YO+kBFRmGq4SqRVB86kQkTwd5ndOX/Rmz98GhqyroKwdhbG+zw8hKeYIK\nSwp8WaXXAgMBAAECggEAExmizngUc2PEtgUvX4z+OuWmMSNZ0BBPA4Knpa3x2GkQ\npMQELYrHUgY1euLzKH8fop2l74jvS8vSOJLbcjE3b+dwaf6WYFGJHy6XqWY7RAsg\n6OGR/y4VcBHGBBUne3n0eJUGLNmRhZNTn2aivgs/05XIZSHgOvP5d+h+/Pgtdcy2\n5R/BH9AaJWeBSbodSLfjuSLNOuNnA2SnWHxJ0+PYSeJnhmfz10STxg9RK3l7cl82\nqnBuNtXg2dOXjHaiqyzYtrVX8GiEn8nzXHaeI9a4mc4SD4FUYMgZwR91E+fkV5JK\np58QWX+9T2vIdA33IGyQS9jQJ4/iuWRLYToq6HpxAQKBgQD0jLRvfs7xpsKkhKA1\nmJpeiDuieERDo6AC+iJuaDGGOo/0fiaztEZw92Y6WkA+Lg1+a06vNjfLMxL8MNc1\nkQYjMP2+XpZxhzUtS7RJeCKVgi5s8O/DXLAocRy7kQH4aocw0SL4fxywN4WIf/UV\npL9eP/brC2Dh+UzCcLxoW65I1wKBgQDqltj8OuWbTke342IehYLTxCBx3aLiU08S\nTSL2j3Svb5OaomASv4+KB+IJk4PsnR3HxMnod6O5fNCJBpo0NsvMGGCXL/1pKsW3\nAIHozDHkOSkK2e8IegZ82g8Jlq//TjQMb624mXMASm75mHQWPQ6EEsvHO1ytMy2V\ndzChGuLrAQKBgQCusGAoER6E8omx+edzwbnr80ceLOkepCCmX8X+tkFCUE0K6p58\n2jdDdQa6gkPH5x/OgZrogENkzOwv6DejVSBcPR/VQD4ZhOsQmzaDEOUrhZ3iRk4P\ncQOJMBvFRLVyna5KyepANpTosBCcTENnnZLyIaEhj7Q6V9pkPyHnLi6WawKBgQCf\nK1jw0zmFRfjtcU/a67XX38Qv3jUtoV8OSN5HMxD2FBuvmSrcrbND8ZNR8hBaFETn\njcN9gufI7EJGJv+sG93tjkDDdGFZ4Raj06lRfnL/qjUJ0tMYCkuqnP4FAIRMExDH\nu2LA1QUtllNz8RgbGrRlsqcneESqlAYC2wtY1HhRAQKBgQDPn+zbJ99ANhT1WX7F\nwKyXExg6slDT7fjqfnTWpZ79VMDH9d0B3kcIkHgCG1TAlyfrLqvOIcbV6K3Xo1Ca\nW/BWmuAFrNVAbvQW/9jqgk0e4fglvjYifC63rp31Rp9PjTN+2kRRsJt6FZJmNYEV\nfFk13vgnA+rP4tOCQjYmyVgR2Q==\n-----END PRIVATE KEY-----\n",
  "client_email": "firebase-adminsdk-ijh59@notification-service-ee07d.iam.gserviceaccount.com",
  "client_id": "101440423795097228821",
  "auth_uri": "https://accounts.google.com/o/oauth2/auth",
  "token_uri": "https://oauth2.googleapis.com/token",
  "auth_provider_x509_cert_url": "https://www.googleapis.com/oauth2/v1/certs",
  "client_x509_cert_url": "https://www.googleapis.com/robot/v1/metadata/x509/firebase-adminsdk-ijh59%40notification-service-ee07d.iam.gserviceaccount.com"
}
