{
  "version": 1,
  "paths": {
    "/v1/user": {
      "name": "/v1/user",
      "lambdaFunction": "userCrud",
      "permissions": {
        "setting": "private",
        "auth": [
          "create",
          "read",
          "update",
          "delete"
        ]
      }
    },
    "/v1/account/{accountID}/team": {
      "name": "/v1/account/{accountID}/team",
      "lambdaFunction": "accountCrud",
      "permissions": {
        "setting": "private",
        "auth": [
          "create",
          "read",
          "update",
          "delete"
        ]
      }
    },
    "/v1/account": {
      "name": "/v1/account",
      "lambdaFunction": "accountCrud",
      "permissions": {
        "setting": "private",
        "auth": [
          "create",
          "read",
          "update",
          "delete"
        ]
      }
    },
    "/v1/user/{userID}": {
      "name": "/v1/user/{userID}",
      "lambdaFunction": "userCrud",
      "permissions": {
        "setting": "private",
        "auth": [
          "create",
          "read",
          "update",
          "delete"
        ]
      }
    },
    "/v1/account/{accountID}": {
      "name": "/v1/account/{accountID}",
      "lambdaFunction": "accountCrud",
      "permissions": {
        "setting": "private",
        "auth": [
          "create",
          "read",
          "update",
          "delete"
        ]
      }
    }
  }
}