{
  "dev": {
    "awscloudformation": {
      "AuthRoleName": "amplify-mindchallengebackend-dev-115053-authRole",
      "UnauthRoleArn": "arn:aws:iam::712003327683:role/amplify-mindchallengebackend-dev-115053-unauthRole",
      "AuthRoleArn": "arn:aws:iam::712003327683:role/amplify-mindchallengebackend-dev-115053-authRole",
      "Region": "us-east-1",
      "DeploymentBucketName": "amplify-mindchallengebackend-dev-115053-deployment",
      "UnauthRoleName": "amplify-mindchallengebackend-dev-115053-unauthRole",
      "StackName": "amplify-mindchallengebackend-dev-115053",
      "StackId": "arn:aws:cloudformation:us-east-1:712003327683:stack/amplify-mindchallengebackend-dev-115053/ab866a10-8dea-11ed-9d46-0af22443bfd3",
      "AmplifyAppId": "d1urihaokmhpf8",
      "APIGatewayAuthURL": "https://s3.amazonaws.com/amplify-mindchallengebackend-dev-115053-deployment/amplify-cfn-templates/api/APIGatewayAuthStack.json"
    },
    "categories": {
      "auth": {
        "cognito8c8d0931": {}
      },
      "function": {
        "mindchallengebackenddocumentDbUtilities": {
          "deploymentBucketName": "amplify-mindchallengebackend-dev-115053-deployment",
          "s3Key": "amplify-builds/mindchallengebackenddocumentDbUtilities-LambdaLayerVersionab272e4e-build.zip"
        },
        "mindchallengebackendjoi": {
          "deploymentBucketName": "amplify-mindchallengebackend-dev-115053-deployment",
          "s3Key": "amplify-builds/mindchallengebackendjoi-LambdaLayerVersion8b0095aa-build.zip"
        },
        "mindchallengebackenduuid": {
          "deploymentBucketName": "amplify-mindchallengebackend-dev-115053-deployment",
          "s3Key": "amplify-builds/mindchallengebackenduuid-LambdaLayerVersion4e31a38b-build.zip"
        },
        "userCrud": {
          "secretsPathAmplifyAppId": "d1urihaokmhpf8",
          "deploymentBucketName": "amplify-mindchallengebackend-dev-115053-deployment",
          "s3Key": "amplify-builds/userCrud-4e6e36553674726b6838-build.zip"
        },
        "documentDbCluster": {},
        "vpc": {},
        "cognito8c8d0931": {},
        "accountCrud": {}
      },
      "api": {
        "mindChallengeApi": {}
      },
      "custom": {
        "documentDbCluster": {},
        "vpc": {}
      }
    }
  }
}