1,Tenant1,10000000000,Tenant1Email
2,Tenant2,11111111111,Tenant2EmailUpdate
,Tenant3,12222222222,
4,Tenant4,13333355555,Tenant4Email

10,,15555555555,Tenant10Email
11,,16666666666,Tenant11EmailUpdate
,,17777777777,
13,,18888855555,Tenant13Email

20,Tenant20,1(012)-345-6790,Tenant20Email
,Tenant30,1(012)(345)6(7)((8))1,

50,Tenant50,15050505050,Tenant50Email
,,1515151515151515151515151,
,,,ErrorEmail
asd,,,asdf
