
#Parsing Errors:
#1 Arg Only:
-10,,,
,BreakNameOld,,
,,0999900000,
,,,BreakEmailOld

#Phone Break
-5,PhoneTooShortOld1,099990,PhoneTooShortOldE1
-4,PhoneTooShortOld2,099991,PhoneTooShortOldE2

#Standard
#New Tenants
#0,NewTen0,0000000000,NewTen0E
#Move Outs
50,MoveOut0,0005000000,MoveOut0Email
#Updates
100,Update0,0010000000,Update0E
#Unchanged
150,Unchange0,0015000000,Unchange0E



BREAK


,,,
#Dummy Entry. Used for parsing testing,,,
0,ParseTesting,+1(454)-345-5941ABRS,
,,,
#Name Keying:
#Full set, change all:
1000,NameChangeAll,5674564757,OEmail
#Full set, nothing
1002,NameGood,9998887776,EmailGood
#Misspelled name, same rest (Keyed on phone)
1003,NameIncorrectOld,0100300000,EmailGood
1004,,0100400000,EmailGood

#Phone Keying:
#Full Set, change all
10500,,0105000000,1005EOld
#Full set, match. Will not alert
1051,,0105100000,1051E
#Email, Phone match, but old has name
1052,1052Name,0105200000,1052E

#Email Keying:
#Change Unit:
11002,,,1100E
#Unit fine
1101,,,1101E
#Email has name or phone attached to old.
1102,,0110200000,1102E
1103,1103Name,,1103E
1104,1104Name,0110400000,1104E


#Break cases.
1150,,,
,1151Name,,
,,0115200000,
,,,1153Email

1154,1154Name,01154,1154Email

BREAK




#Paired with Standard Call - No change required,,,
1,NoChange,10123456789,NoChangeE
2,,12345678912,NoChangeNoNameE
,,,
#Paired with Standard Call - Updating information,,,
7,Change1,14564564565,Change1EOld
8,,13333333333,Change2ENew
,,,
#Paired with Standard Call - Parsable Phone #, Update,,
15,Wrong Phone Format2,18888888888,PhoneFormatOld2E
,,,
#Paired with Alarm Call - Duplicate in Old,,,
20,DupOldName,19876543211,DupOldNameE1
20,DupOldName,19876543211,DupOldNameE2
21,,17778889999,DupOldPhoneE1
21,,17778889999,DupOldPhoneE2
,,,
#Paired with Alarm Call - No name?,,,
60,Steve,15554448877,
