%YAML 1.1
%TAG !u! tag:unity3d.com,2011:
--- !u!1045 &1
EditorBuildSettings:
  m_ObjectHideFlags: 0
  serializedVersion: 2
  m_Scenes:
  - enabled: 1
    path: Assets/Scenes/SampleScene.unity
    guid: 99c9720ab356a0642a771bea13969a05
  m_configObjects:
    com.unity.xr.management.loader_settings: {fileID: 11400000, guid: f7364762432c96a4f9e3531ebce4e3a5,
      type: 2}
    com.unity.xr.openxr.settings4: {fileID: 11400000, guid: bb4f19b618bec00429b4338dc44c50fa,
      type: 2}
    xr.sdk.mock-hmd.settings: {fileID: 11400000, guid: f504889b26ef9b642b28c71acf3936a6,
      type: 2}
  m_UseUCBPForAssetBundles: 0
