%YAML 1.1
%TAG !u! tag:unity3d.com,2011:
--- !u!1001 &9019706216644937301
PrefabInstance:
  m_ObjectHideFlags: 0
  serializedVersion: 2
  m_Modification:
    serializedVersion: 3
    m_TransformParent: {fileID: 0}
    m_Modifications:
    - target: {fileID: 100000, guid: d6812f3f59620f84c91bbeb477f8f32b, type: 3}
      propertyPath: m_Name
      value: Building_Apartment_13
      objectReference: {fileID: 0}
    - target: {fileID: 400000, guid: d6812f3f59620f84c91bbeb477f8f32b, type: 3}
      propertyPath: m_LocalPosition.x
      value: 42.83592
      objectReference: {fileID: 0}
    - target: {fileID: 400000, guid: d6812f3f59620f84c91bbeb477f8f32b, type: 3}
      propertyPath: m_LocalPosition.y
      value: 0.3
      objectReference: {fileID: 0}
    - target: {fileID: 400000, guid: d6812f3f59620f84c91bbeb477f8f32b, type: 3}
      propertyPath: m_LocalPosition.z
      value: 39.128338
      objectReference: {fileID: 0}
    - target: {fileID: 400000, guid: d6812f3f59620f84c91bbeb477f8f32b, type: 3}
      propertyPath: m_LocalRotation.w
      value: 0.7071068
      objectReference: {fileID: 0}
    - target: {fileID: 400000, guid: d6812f3f59620f84c91bbeb477f8f32b, type: 3}
      propertyPath: m_LocalRotation.x
      value: -0.7071068
      objectReference: {fileID: 0}
    - target: {fileID: 400000, guid: d6812f3f59620f84c91bbeb477f8f32b, type: 3}
      propertyPath: m_LocalRotation.y
      value: 0
      objectReference: {fileID: 0}
    - target: {fileID: 400000, guid: d6812f3f59620f84c91bbeb477f8f32b, type: 3}
      propertyPath: m_LocalRotation.z
      value: -0
      objectReference: {fileID: 0}
    - target: {fileID: 400000, guid: d6812f3f59620f84c91bbeb477f8f32b, type: 3}
      propertyPath: m_LocalEulerAnglesHint.x
      value: 0
      objectReference: {fileID: 0}
    - target: {fileID: 400000, guid: d6812f3f59620f84c91bbeb477f8f32b, type: 3}
      propertyPath: m_LocalEulerAnglesHint.y
      value: 0
      objectReference: {fileID: 0}
    - target: {fileID: 400000, guid: d6812f3f59620f84c91bbeb477f8f32b, type: 3}
      propertyPath: m_LocalEulerAnglesHint.z
      value: 0
      objectReference: {fileID: 0}
    m_RemovedComponents:
    - {fileID: 9500000, guid: d6812f3f59620f84c91bbeb477f8f32b, type: 3}
    m_RemovedGameObjects: []
    m_AddedGameObjects: []
    m_AddedComponents:
    - targetCorrespondingSourceObject: {fileID: 100000, guid: d6812f3f59620f84c91bbeb477f8f32b,
        type: 3}
      insertIndex: -1
      addedObject: {fileID: 7864346359801040398}
  m_SourcePrefab: {fileID: 100100000, guid: d6812f3f59620f84c91bbeb477f8f32b, type: 3}
--- !u!1 &9019706216644903157 stripped
GameObject:
  m_CorrespondingSourceObject: {fileID: 100000, guid: d6812f3f59620f84c91bbeb477f8f32b,
    type: 3}
  m_PrefabInstance: {fileID: 9019706216644937301}
  m_PrefabAsset: {fileID: 0}
--- !u!65 &7864346359801040398
BoxCollider:
  m_ObjectHideFlags: 0
  m_CorrespondingSourceObject: {fileID: 0}
  m_PrefabInstance: {fileID: 0}
  m_PrefabAsset: {fileID: 0}
  m_GameObject: {fileID: 9019706216644903157}
  m_Material: {fileID: 0}
  m_IncludeLayers:
    serializedVersion: 2
    m_Bits: 0
  m_ExcludeLayers:
    serializedVersion: 2
    m_Bits: 0
  m_LayerOverridePriority: 0
  m_IsTrigger: 0
  m_ProvidesContacts: 1
  m_Enabled: 1
  serializedVersion: 3
  m_Size: {x: 0.073820114, y: 0.07628228, z: 0.0751771}
  m_Center: {x: 0.00007038116, y: -0.0017717886, z: 0.037518993}
