%YAML 1.1
%TAG !u! tag:unity3d.com,2011:
--- !u!1001 &3894811515644560355
PrefabInstance:
  m_ObjectHideFlags: 0
  serializedVersion: 2
  m_Modification:
    serializedVersion: 3
    m_TransformParent: {fileID: 0}
    m_Modifications:
    - target: {fileID: 100000, guid: 5e2014be033556f40a1edc309b04e729, type: 3}
      propertyPath: m_Name
      value: Old_building_NYC_#3
      objectReference: {fileID: 0}
    - target: {fileID: 400000, guid: 5e2014be033556f40a1edc309b04e729, type: 3}
      propertyPath: m_LocalPosition.x
      value: 0
      objectReference: {fileID: 0}
    - target: {fileID: 400000, guid: 5e2014be033556f40a1edc309b04e729, type: 3}
      propertyPath: m_LocalPosition.y
      value: 0
      objectReference: {fileID: 0}
    - target: {fileID: 400000, guid: 5e2014be033556f40a1edc309b04e729, type: 3}
      propertyPath: m_LocalPosition.z
      value: 0
      objectReference: {fileID: 0}
    - target: {fileID: 400000, guid: 5e2014be033556f40a1edc309b04e729, type: 3}
      propertyPath: m_LocalRotation.w
      value: 1
      objectReference: {fileID: 0}
    - target: {fileID: 400000, guid: 5e2014be033556f40a1edc309b04e729, type: 3}
      propertyPath: m_LocalRotation.x
      value: 0
      objectReference: {fileID: 0}
    - target: {fileID: 400000, guid: 5e2014be033556f40a1edc309b04e729, type: 3}
      propertyPath: m_LocalRotation.y
      value: 0
      objectReference: {fileID: 0}
    - target: {fileID: 400000, guid: 5e2014be033556f40a1edc309b04e729, type: 3}
      propertyPath: m_LocalRotation.z
      value: 0
      objectReference: {fileID: 0}
    - target: {fileID: 400000, guid: 5e2014be033556f40a1edc309b04e729, type: 3}
      propertyPath: m_LocalEulerAnglesHint.x
      value: 0
      objectReference: {fileID: 0}
    - target: {fileID: 400000, guid: 5e2014be033556f40a1edc309b04e729, type: 3}
      propertyPath: m_LocalEulerAnglesHint.y
      value: 0
      objectReference: {fileID: 0}
    - target: {fileID: 400000, guid: 5e2014be033556f40a1edc309b04e729, type: 3}
      propertyPath: m_LocalEulerAnglesHint.z
      value: 0
      objectReference: {fileID: 0}
    - target: {fileID: 400002, guid: 5e2014be033556f40a1edc309b04e729, type: 3}
      propertyPath: m_LocalPosition.x
      value: 4.72
      objectReference: {fileID: 0}
    - target: {fileID: 400002, guid: 5e2014be033556f40a1edc309b04e729, type: 3}
      propertyPath: m_LocalPosition.y
      value: -0.21
      objectReference: {fileID: 0}
    - target: {fileID: 400002, guid: 5e2014be033556f40a1edc309b04e729, type: 3}
      propertyPath: m_LocalPosition.z
      value: 4.27
      objectReference: {fileID: 0}
    - target: {fileID: 400004, guid: 5e2014be033556f40a1edc309b04e729, type: 3}
      propertyPath: m_LocalPosition.x
      value: -0.60897374
      objectReference: {fileID: 0}
    - target: {fileID: 400004, guid: 5e2014be033556f40a1edc309b04e729, type: 3}
      propertyPath: m_LocalPosition.y
      value: 2.59
      objectReference: {fileID: 0}
    - target: {fileID: 400004, guid: 5e2014be033556f40a1edc309b04e729, type: 3}
      propertyPath: m_LocalPosition.z
      value: 1.5054431
      objectReference: {fileID: 0}
    - target: {fileID: 400006, guid: 5e2014be033556f40a1edc309b04e729, type: 3}
      propertyPath: m_LocalPosition.x
      value: -0.030860186
      objectReference: {fileID: 0}
    - target: {fileID: 400006, guid: 5e2014be033556f40a1edc309b04e729, type: 3}
      propertyPath: m_LocalPosition.y
      value: 4.32
      objectReference: {fileID: 0}
    - target: {fileID: 400006, guid: 5e2014be033556f40a1edc309b04e729, type: 3}
      propertyPath: m_LocalPosition.z
      value: 4.290569
      objectReference: {fileID: 0}
    - target: {fileID: 400008, guid: 5e2014be033556f40a1edc309b04e729, type: 3}
      propertyPath: m_LocalPosition.x
      value: 0
      objectReference: {fileID: 0}
    - target: {fileID: 400008, guid: 5e2014be033556f40a1edc309b04e729, type: 3}
      propertyPath: m_LocalPosition.y
      value: -0.46
      objectReference: {fileID: 0}
    - target: {fileID: 400008, guid: 5e2014be033556f40a1edc309b04e729, type: 3}
      propertyPath: m_LocalPosition.z
      value: 0
      objectReference: {fileID: 0}
    - target: {fileID: 400010, guid: 5e2014be033556f40a1edc309b04e729, type: 3}
      propertyPath: m_LocalPosition.x
      value: -0.4815359
      objectReference: {fileID: 0}
    - target: {fileID: 400010, guid: 5e2014be033556f40a1edc309b04e729, type: 3}
      propertyPath: m_LocalPosition.y
      value: 4.08
      objectReference: {fileID: 0}
    - target: {fileID: 400010, guid: 5e2014be033556f40a1edc309b04e729, type: 3}
      propertyPath: m_LocalPosition.z
      value: -0.8596692
      objectReference: {fileID: 0}
    m_RemovedComponents: []
    m_RemovedGameObjects: []
    m_AddedGameObjects: []
    m_AddedComponents:
    - targetCorrespondingSourceObject: {fileID: 100000, guid: 5e2014be033556f40a1edc309b04e729,
        type: 3}
      insertIndex: -1
      addedObject: {fileID: 9167821686862327459}
  m_SourcePrefab: {fileID: 100100000, guid: 5e2014be033556f40a1edc309b04e729, type: 3}
--- !u!1 &3894811515644659011 stripped
GameObject:
  m_CorrespondingSourceObject: {fileID: 100000, guid: 5e2014be033556f40a1edc309b04e729,
    type: 3}
  m_PrefabInstance: {fileID: 3894811515644560355}
  m_PrefabAsset: {fileID: 0}
--- !u!65 &9167821686862327459
BoxCollider:
  m_ObjectHideFlags: 0
  m_CorrespondingSourceObject: {fileID: 0}
  m_PrefabInstance: {fileID: 0}
  m_PrefabAsset: {fileID: 0}
  m_GameObject: {fileID: 3894811515644659011}
  m_Material: {fileID: 0}
  m_IncludeLayers:
    serializedVersion: 2
    m_Bits: 0
  m_ExcludeLayers:
    serializedVersion: 2
    m_Bits: 0
  m_LayerOverridePriority: 0
  m_IsTrigger: 0
  m_ProvidesContacts: 0
  m_Enabled: 1
  serializedVersion: 3
  m_Size: {x: 1, y: 1, z: 1}
  m_Center: {x: 0, y: 0, z: 0}
