[
  {
    "name": "id",
    "dbType": "increments",
    "htmlType": "",
    "validations": "",
    "searchable": false,
    "fillable": false,
    "primary": true,
    "inForm": false,
    "inIndex": false
  },
  {
    "name": "profile_id",
    "dbType": "integer:unsigned:default,0:foreign,profiles,id:nullable",
    "htmlType": "text",
    "validations": "required:integer",
    "relation": "mt1,Profile,profile_id,id",
    "searchable": false
  },
  {
    "name": "total",
    "dbType": "double",
    "htmlType": "integer",
    "validations": "required:integer",
    "searchable": false
  },
	{
		"name": "account_number",
		"dbType": "string:100",
		"htmlType": "text",
		"validations": "required:integer",
		"searchable": false
	},
	{
		"name": "email",
		"dbType": "string:100",
		"htmlType": "text",
		"validations": "required:integer",
		"searchable": false
	},
  {
    "name": "created_at",
    "dbType": "timestamp",
    "htmlType": "",
    "validations": "",
    "searchable": false,
    "fillable": false,
    "primary": false,
    "inForm": false,
    "inIndex": false
  },
  {
    "name": "updated_at",
    "dbType": "timestamp",
    "htmlType": "",
    "validations": "",
    "searchable": false,
    "fillable": false,
    "primary": false,
    "inForm": false,
    "inIndex": false
  }
]
