[
  {
    "name": "id",
    "dbType": "increments",
    "htmlType": "",
    "validations": "",
    "searchable": false,
    "fillable": false,
    "primary": true,
    "inForm": false,
    "inIndex": false
  },
  {
    "name": "commission_id",
    "dbType": "integer:unsigned:foreign,commissions,id:nullable",
    "htmlType": "text",
    "validations": "required:integer",
    "relation": "mt1,Commission,commission_id,id",
    "searchable": false
  },
  {
    "name": "commission_payment_id",
    "dbType": "integer:unsigned:foreign,commission_payments,id:nullable",
    "htmlType": "text",
    "validations": "required:integer",
    "relation": "mt1,CommissionPayment,commission_payment_id,id",
    "searchable": false
  },
  {
    "name": "created_at",
    "dbType": "timestamp",
    "htmlType": "",
    "validations": "",
    "searchable": false,
    "fillable": false,
    "primary": false,
    "inForm": false,
    "inIndex": false
  },
  {
    "name": "updated_at",
    "dbType": "timestamp",
    "htmlType": "",
    "validations": "",
    "searchable": false,
    "fillable": false,
    "primary": false,
    "inForm": false,
    "inIndex": false
  }
]
