[
  {
    "name": "id",
    "dbType": "increments",
    "htmlType": "",
    "validations": "",
    "searchable": false,
    "fillable": false,
    "primary": true,
    "inForm": false,
    "inIndex": false
  },
  {
    "name": "barcode",
    "dbType": "string,300",
    "htmlType": "text",
    "validations": "required:string",
    "searchable": true
  },
  {
    "name": "reference_no",
    "dbType": "string,300:nullable",
    "htmlType": "text",
    "validations": "required:string",
    "searchable": true
  },
  {
    "name": "code",
    "dbType": "string,300",
    "htmlType": "text",
    "validations": "required:string",
    "searchable": true
  },
  {
    "name": "description",
    "dbType": "string,300",
    "htmlType": "text",
    "validations": "required:string",
    "searchable": true
  },
  {
    "name": "weight",
    "dbType": "double",
    "htmlType": "text",
    "validations": "required:double",
    "searchable": true
  },
  {
    "name": "profile_id",
    "dbType": "integer:unsigned:default,0:foreign,profiles,id:nullable",
    "htmlType": "text",
    "validations": "required:integer",
    "relation": "mt1,Profile,profile_id,id",
    "searchable": false
  },
  {
    "name": "parent_id",
    "dbType": "integer:unsigned:default,0:foreign,packages,id:nullable",
    "htmlType": "text",
    "validations": "required:integer",
    "relation": "mt1,Package,parent_id,id",
    "searchable": false
  },
  {
    "name": "created_at",
    "dbType": "timestamp",
    "htmlType": "",
    "validations": "",
    "searchable": false,
    "fillable": false,
    "primary": false,
    "inForm": false,
    "inIndex": false
  },
  {
    "name": "updated_at",
    "dbType": "timestamp",
    "htmlType": "",
    "validations": "",
    "searchable": false,
    "fillable": false,
    "primary": false,
    "inForm": false,
    "inIndex": false
  }
]
