[
  {
    "name": "id",
    "dbType": "increments",
    "htmlType": "",
    "validations": "",
    "searchable": false,
    "fillable": false,
    "primary": true,
    "inForm": false,
    "inIndex": false
  },
  {
    "name": "name",
    "dbType": "string",
    "htmlType": "text",
    "validations": "required:string",
    "searchable": false
  },
  {
    "name": "contact",
    "dbType": "string",
    "htmlType": "text",
    "validations": "required:string",
    "searchable": false
  },
  {
    "name": "identifier",
    "dbType": "string",
    "htmlType": "text",
    "validations": "required:string",
    "searchable": false
  },
  {
    "name": "package_id",
    "dbType": "integer:unsigned:foreign,packages,id:nullable",
    "htmlType": "text",
    "validations": "required:integer",
    "relation": "mt1,Package,package_id,id",
    "searchable": false
  },
  {
    "name": "created_at",
    "dbType": "timestamp",
    "htmlType": "",
    "validations": "",
    "searchable": false,
    "fillable": false,
    "primary": false,
    "inForm": false,
    "inIndex": false
  },
  {
    "name": "updated_at",
    "dbType": "timestamp",
    "htmlType": "",
    "validations": "",
    "searchable": false,
    "fillable": false,
    "primary": false,
    "inForm": false,
    "inIndex": false
  }
]
