[
  {
    "name": "id",
    "dbType": "increments",
    "htmlType": "",
    "validations": "",
    "searchable": false,
    "fillable": false,
    "primary": true,
    "inForm": false,
    "inIndex": false
  },
  {
    "name": "name",
    "dbType": "string,233",
    "htmlType": "text",
    "validations": "required:string",
    "searchable": false
  },
  {
    "name": "address",
    "dbType": "string,233:nullable",
    "htmlType": "text",
    "validations": "required:string",
    "searchable": false
  },
  {
    "name": "contact_number",
    "dbType": "string,233:nullable",
    "htmlType": "text",
    "validations": "required:string",
    "searchable": false
  },
  {
    "name": "location_id",
    "dbType": "integer:unsigned:foreign,locations,id:nullable",
    "htmlType": "text",
    "validations": "required:integer",
    "relation": "mt1,Location,location_id,id",
    "searchable": false
  },
  {
    "name": "package_id",
    "dbType": "integer:unsigned:default,0:foreign,packages,id:nullable",
    "htmlType": "text",
    "validations": "required:integer",
    "relation": "mt1,Package,package_id,id",
    "searchable": false
  },
  {
    "name": "created_at",
    "dbType": "timestamp",
    "htmlType": "",
    "validations": "",
    "searchable": false,
    "fillable": false,
    "primary": false,
    "inForm": false,
    "inIndex": false
  },
  {
    "name": "updated_at",
    "dbType": "timestamp",
    "htmlType": "",
    "validations": "",
    "searchable": false,
    "fillable": false,
    "primary": false,
    "inForm": false,
    "inIndex": false
  }
]
