[
  {
    "name": "id",
    "dbType": "increments",
    "htmlType": "",
    "validations": "",
    "searchable": false,
    "fillable": false,
    "primary": true,
    "inForm": false,
    "inIndex": false
  },
  {
    "name": "location_id",
    "dbType": "integer:unsigned:default,0:foreign,locations,id",
    "htmlType": "text",
    "validations": "required:integer",
    "relation": "mt1,Location,profile_id,id",
    "searchable": false
  },
  {
    "name": "rate",
    "dbType": "double",
    "htmlType": "text",
    "searchable": false
  },
  {
    "name": "created_at",
    "dbType": "timestamp",
    "htmlType": "",
    "validations": "",
    "searchable": false,
    "fillable": false,
    "primary": false,
    "inForm": false,
    "inIndex": false
  },
  {
    "name": "updated_at",
    "dbType": "timestamp",
    "htmlType": "",
    "validations": "",
    "searchable": false,
    "fillable": false,
    "primary": false,
    "inForm": false,
    "inIndex": false
  }
]
