[
    {"name": "Cerveja",         "price": "R$ 3,00"},
    {"name": "Vodka",           "price": "R$ 6,00"},
    {"name": "Energético",      "price": "R$ 6,00"},
    {"name": "Jurupinga",       "price": "R$ 5,00"},
    {"name": "Água",            "price": "R$ 3,00"},
    {"name": "Refrigerante",    "price": "R$ 3,00"}
]
