[
    {"name": "DJ Juninho",  "time": "18:00 às 19:30", "star": "enable",   "picture": "juniorramos.png"},
    {"name": "DJ Ricardo",  "time": "19:30 às 22:00", "star": "disable",  "picture": "caminha.png"},
    {"name": "DJ Henrique", "time": "22:00 às 00:30", "star": "enable",   "picture": "dagostini.png"},
    {"name": "DJ Savi",     "time": "00:30 às 02:00", "star": "disable",  "picture": "savi.png"}
]
