[
    {"name": "4 Cervejas",                  "price": "R$ 10,00"},
    {"name": "2 Vodkas + 1 Refrigerante",  "price": "R$ 10,00"},
    {"name": "1 Vodka + 1 Energético",      "price": "R$ 10,00"},
    {"name": "3 Jurupingas",                "price": "R$ 13,00"},
    {"name": "Baldinho",        "price": "R$ 20,00"}
]
