<svg xmlns="http://www.w3.org/2000/svg" width="232.054" height="212.42" viewBox="0 0 232.054 212.42">
    <g id="svg_logo" transform="translate(-676.946 -1907)">
        <circle id="Ellipse_6" data-name="Ellipse 6" cx="17" cy="17" r="17" transform="translate(789 1979)" fill="#202349"/>
        <path id="Pfad_1818" data-name="Pfad 1818" d="M7.574,26.911h25.3l7.572,28.994H-1.475Z" transform="translate(786 1981)" fill="#202349"/>
        <g id="Ellipse_5" data-name="Ellipse 5" transform="translate(702 1907)" fill="none" stroke="#202349" stroke-width="17">
            <circle cx="103.5" cy="103.5" r="103.5" stroke="none"/>
            <circle cx="103.5" cy="103.5" r="95" fill="none"/>
        </g>
        <path id="Pfad_1821" data-name="Pfad 1821"
              d="M-13.573-49.325S36.616-43.078,51.907-.858,62.462,60.1,85.08,82.719s54.479,35.309,54.479,35.309-26.006,12.92-88.8-34.172C13.458,52.646,3.442,24.158.713,8.988,6.392-31.238-13.573-49.325-13.573-49.325Z"
              transform="translate(708 1987)" fill="#02598b"/>
        <path id="Pfad_1820" data-name="Pfad 1820"
              d="M-22.081-32.426S30.152-22.4,45.876,14.867,61.207,64.3,78.4,83.15c20.855,22.861,61.18,34.836,61.18,34.836S91.865,122.272,29.075,75.18C-8.23,43.97,1.549,31-1.18,15.83A59.558,59.558,0,0,0-22.081-32.426Z"
              transform="translate(708 1987)" fill="#008cc0"/>
        <path id="Pfad_1819" data-name="Pfad 1819"
              d="M-31.054-10.763s52.375-11.2,80.162,57.941,90.528,70.809,90.528,70.809-50.92,37.923-113.71-9.17c-37.3-31.21-28.851-61.286-31.58-76.456C-13.411.042-31.054-10.763-31.054-10.763Z"
              transform="translate(708 1987)" fill="#5ec4e6"/>
    </g>
</svg>
