﻿<?xml version="1.0" encoding="utf-8"?>
<!-- Generator: Adobe Illustrator 24.1.1, SVG Export Plug-In . SVG Version: 6.00 Build 0)  -->
<svg version="1.1" xmlns="http://www.w3.org/2000/svg" xmlns:xlink="http://www.w3.org/1999/xlink" x="0px" y="0px"
	 viewBox="0 0 297 210" style="enable-background:new 0 0 297 210;" xml:space="preserve">
<style type="text/css">
	.st0{fill:#FFFFFF;stroke:#000000;stroke-miterlimit:10;}
	.st1{fill:#FFFFFF;stroke:#000000;stroke-width:2;stroke-miterlimit:10;}
	.st2{stroke:#000000;stroke-miterlimit:10;}
	.st3{fill:none;stroke:#000000;stroke-width:2;stroke-linecap:round;stroke-miterlimit:10;}
	.st4{fill:none;stroke:#000000;stroke-width:2;stroke-miterlimit:10;}
</style>
<g id="Ebene_1">
	<path class="st0" d="M153.8,180.1c-0.48,0.61-1.14,1.57-1.68,2.85c-1.32,3.18-0.66,5.52-1.34,5.7c-0.74,0.19-2.44-2.38-2.85-5.19
		c-0.33-2.25,0.24-4.13,0.67-5.19"/>
	<path class="st0" d="M151.29,191.82"/>
	<g>
		<path class="st0" d="M163.1,180.18c0.48,0.61,1.14,1.57,1.68,2.85c1.32,3.18,0.66,5.52,1.34,5.7c0.74,0.19,2.44-2.38,2.85-5.19
			c0.33-2.25-0.24-4.13-0.67-5.19"/>
	</g>
	<ellipse class="st1" cx="157.74" cy="127.06" rx="32.14" ry="33.67"/>
	<ellipse class="st1" cx="157.74" cy="165.05" rx="18.09" ry="16.08"/>
	<ellipse class="st0" cx="151.35" cy="170.1" rx="4.08" ry="5.08"/>
	<circle class="st2" cx="152.3" cy="171.35" r="2.3"/>
	<ellipse class="st0" cx="164.17" cy="170.1" rx="4.08" ry="5.08"/>
	<circle class="st2" cx="165.12" cy="171.35" r="2.3"/>
	<path class="st3" d="M118.73,67.5c-1.32,5.9-3.34,12.82-6.46,20.3c-2.65,6.35-5.57,11.81-8.35,16.38c8,2.9,16,5.81,23.99,8.71"/>
	<path class="st3" d="M87.5,107.09c3.12,2.35,6.74,5.47,10.35,9.52c3.08,3.45,5.47,6.8,7.32,9.75c6.81,0.23,13.62,0.47,20.43,0.7"/>
	<path class="st3" d="M94.09,167.42c2.58-2.84,5.84-7.01,8.63-12.62c2.71-5.45,4.06-10.44,4.77-14.15c0.09-0.02,0.19-0.05,0.28-0.07
		c2.38-0.85,5.36-1.69,8.84-2.2c3.95-0.58,7.42-0.57,10.17-0.37"/>
	<path class="st3" d="M126.75,188.74c-1.24-4.85-2.49-9.7-3.73-14.54c-1.14-4.45-2.28-8.9-3.42-13.35c0.06,0.25,0.13,0.5,0.19,0.75
		c2.02-0.59,4.29-1.38,6.7-2.49c3.54-1.62,7.95-4.47,10.23-6.15"/>
	<path class="st3" d="M188.56,189.39c1.05-3.92,2.75-9.01,5.57-14.61c2.76-5.49,5.76-9.8,8.24-12.93
		c-6.28-4.9-12.55-9.81-18.83-14.71"/>
	<path class="st3" d="M201.21,62.01c-0.1,3.56,0.12,8.03,1.17,13.07c1.57,7.49,4.4,13.29,6.7,17.17
		c-8.12,4.84-16.25,9.69-24.37,14.53"/>
	<path class="st3" d="M219.97,168.87c0.17-3.49,0-8.74-1.84-14.74c-1.46-4.76-3.49-8.46-5.19-11.06c-0.95-0.33-1.9-0.66-2.85-0.99
		c-6.76-2.35-13.51-4.7-20.27-7.05"/>
	<path class="st4" d="M83.95,180.1"/>
	<path class="st3" d="M226.83,96.68c-2.65,2.3-5.63,5.27-8.54,9.05c-4.47,5.79-7.2,11.41-8.88,15.75c-0.22,0.06-0.45,0.11-0.67,0.17
		l-18.43,0.5"/>
	<line class="st3" x1="157.15" y1="5.89" x2="157.15" y2="93.16"/>
</g>
<g id="Ebene_2">
</g>
</svg>
