<?xml version="1.0" encoding="UTF-8"?>
<svg width="14px" height="9px" viewBox="0 0 14 9" version="1.1" xmlns="http://www.w3.org/2000/svg" xmlns:xlink="http://www.w3.org/1999/xlink">
    <!-- Generator: Sketch 64 (93537) - https://sketch.com -->
    <title>04 Icons / Plus</title>
    <desc>Created with Sketch.</desc>
    <g id="Page-1" stroke="none" stroke-width="1" fill="none" fill-rule="evenodd">
        <g id="1440---Buy-Plan---Billing-Address---1" transform="translate(-585.000000, -536.000000)" fill="#8590A4" fill-rule="nonzero">
            <g id="Billing-Address" transform="translate(280.000000, 365.500000)">
                <g id="country" transform="translate(0.000000, 162.000000)">
                    <g id="02-Buttons-/-Dropdown-Arrow" transform="translate(304.000000, 4.000000)">
                        <path d="M4.1997918,5.39759884 L4.21176072,5.40934897 L7.97812051,9.15272395 L11.6983079,5.43299482 C12.2048628,4.92643995 13.0076368,4.89664261 13.549041,5.34360278 L13.6473552,5.43299482 L13.6502298,5.4358779 C14.123514,5.911975 14.1761168,6.64772561 13.8094057,7.18155284 L7.98942475,12.9985095 L2.18595858,7.19776109 C1.795191,6.66570709 1.83467506,5.91526886 2.30813272,5.42690859 C2.82240629,4.8964477 3.6693309,4.88332527 4.1997918,5.39759884 Z" id="Combined-Shape"></path>
                    </g>
                </g>
            </g>
        </g>
    </g>
</svg>