<?xml version="1.0" encoding="UTF-8"?>
<svg width="77px" height="59px" viewBox="0 0 77 59" version="1.1" xmlns="http://www.w3.org/2000/svg" xmlns:xlink="http://www.w3.org/1999/xlink">
    <!-- Generator: Sketch 64 (93537) - https://sketch.com -->
    <title>“</title>
    <desc>Created with Sketch.</desc>
    <g id="Page-1" stroke="none" stroke-width="1" fill="none" fill-rule="evenodd">
        <g id="1920" transform="translate(-1068.000000, -7500.000000)" fill="#FFFFFF" fill-rule="nonzero" stroke="#0263FF" stroke-width="3.4">
            <g id="testimonials" transform="translate(-251.000000, 7381.000000)">
                <g id="client-1" transform="translate(744.000000, 119.000000)">
                    <path d="M642.121401,2.09960385 C640.269293,2.85186275 638.169018,3.87939204 635.818838,5.17817592 C632.944722,6.76650289 630.188297,8.9649228 627.541588,11.7628724 C624.884137,14.572178 622.614193,18.1075509 620.716477,22.358435 C618.817391,26.6123884 617.888122,31.7811836 617.888122,37.8549796 C617.888122,43.5590698 619.376048,48.1563192 622.455452,51.602319 C625.482619,54.9898627 629.680555,56.63 634.996571,56.63 C639.140085,56.63 642.617369,55.4028471 645.408084,52.8983595 C648.14943,50.4381772 649.486122,47.1589199 649.486122,43.0927755 C649.486122,38.9892194 648.363891,35.67322 646.020874,33.1882015 C643.774741,30.8059392 641.305601,29.555551 638.567796,29.555551 C637.96322,29.555551 637.371745,29.6165247 636.792879,29.7371957 C636.779934,29.0540398 636.807846,28.3702576 636.876233,27.6863947 C637.225062,24.1980977 638.605718,20.9203923 641.049625,17.8655082 C642.964286,15.4721816 645.203655,13.5931051 648.05664,12.1153199 L642.121401,2.09960385 Z M600.933278,2.09960385 C599.08117,2.85186275 596.980896,3.87939204 594.630715,5.17817592 C591.7566,6.76650289 589.000175,8.9649228 586.353466,11.7628724 C583.696014,14.572178 581.426071,18.1075509 579.528355,22.358435 C577.629268,26.6123884 576.7,31.7811836 576.7,37.8549796 C576.7,43.5590698 578.187926,48.1563192 581.26733,51.602319 C584.294496,54.9898627 588.492432,56.63 593.808449,56.63 C597.951962,56.63 601.429247,55.4028471 604.219962,52.8983595 C606.961308,50.4381772 608.298,47.1589199 608.298,43.0927755 C608.298,38.9892194 607.175769,35.67322 604.832751,33.1882015 C602.586618,30.8059392 600.117478,29.555551 597.379673,29.555551 C596.775097,29.555551 596.183622,29.6165247 595.604756,29.7371957 C595.591812,29.0540398 595.619724,28.3702576 595.68811,27.6863947 C596.03694,24.1980977 597.417595,20.9203923 599.861503,17.8655082 C601.776164,15.4721816 604.015533,13.5931051 606.868517,12.1153199 L600.933278,2.09960385 Z" id="“"></path>
                </g>
            </g>
        </g>
    </g>
</svg>