<?xml version="1.0" encoding="UTF-8"?>
<svg width="831px" height="879px" viewBox="0 0 831 879" version="1.1" xmlns="http://www.w3.org/2000/svg" xmlns:xlink="http://www.w3.org/1999/xlink">
    <!-- Generator: Sketch 64 (93537) - https://sketch.com -->
    <title>blue back</title>
    <desc>Created with Sketch.</desc>
    <g id="Page-1" stroke="none" stroke-width="1" fill="none" fill-rule="evenodd" stroke-linecap="round" stroke-linejoin="round">
        <g id="1920" transform="translate(-556.000000, -7986.000000)" fill-rule="nonzero" stroke="#0263FF" stroke-width="3.4">
            <path d="M560,7988 L1368,7988 L1368,7988 C1360.94844,8228.43566 1360.94844,8468.24786 1368,8707.43661 C1370.42266,8789.61309 1366.39259,8791.37919 1384.78291,8857.73187 C1174.03825,8880.31465 1116.15749,8826 1013.86432,8826 C862.57621,8826 711.288105,8826 560,8826 C558.895431,8826 558,8825.10457 558,8824 L558,7990 C558,7988.89543 558.895431,7988 560,7988 Z" id="blue-back"></path>
        </g>
    </g>
</svg>