<?xml version="1.0" encoding="UTF-8"?>
<svg width="51px" height="50px" viewBox="0 0 51 50" version="1.1" xmlns="http://www.w3.org/2000/svg" xmlns:xlink="http://www.w3.org/1999/xlink">
    <!-- Generator: Sketch 64 (93537) - https://sketch.com -->
    <title>Group 8</title>
    <desc>Created with Sketch.</desc>
    <g id="Page-1" stroke="none" stroke-width="1" fill="none" fill-rule="evenodd" stroke-linecap="round" stroke-linejoin="round">
        <g id="1920" transform="translate(-824.000000, -1790.000000)" fill-rule="nonzero">
            <g id="Group-8" transform="translate(826.000000, 1792.000000)">
                <circle id="Oval" stroke="#0263FF" stroke-width="2" transform="translate(23.000000, 23.000000) scale(-1, 1) translate(-23.000000, -23.000000) " cx="23" cy="23" r="24"></circle>
                <line x1="7" y1="41" x2="42" y2="6" id="Line-3" stroke="#FFFFFF" stroke-width="12.5" transform="translate(24.500000, 23.500000) scale(-1, 1) translate(-24.500000, -23.500000) "></line>
                <line x1="12" y1="33.1715731" x2="44.1715731" y2="1" id="Line-3" stroke="#0263FF" transform="translate(28.085787, 17.085786) scale(-1, 1) translate(-28.085787, -17.085786) "></line>
                <line x1="11" y1="43" x2="11" y2="2" id="Line-3" stroke="#0263FF" transform="translate(11.000000, 22.500000) scale(-1, 1) translate(-11.000000, -22.500000) "></line>
            </g>
        </g>
    </g>
</svg>