<?xml version="1.0" encoding="UTF-8"?>
<svg width="19px" height="15px" viewBox="0 0 19 15" version="1.1" xmlns="http://www.w3.org/2000/svg" xmlns:xlink="http://www.w3.org/1999/xlink">
    <!-- Generator: Sketch 64 (93537) - https://sketch.com -->
    <title>04 Icons / Checkmark</title>
    <desc>Created with Sketch.</desc>
    <g id="Page-1" stroke="none" stroke-width="1" fill="none" fill-rule="evenodd">
        <g id="1920" transform="translate(-998.000000, -4718.000000)" fill="#0263FF" fill-rule="nonzero">
            <g id="Plans-Comparison-Table" transform="translate(463.000000, 4284.316406)">
                <g id="icons" transform="translate(350.942708, 431.914063)">
                    <g id="sections">
                        <g id="04-Icons-/-Checkmark" transform="translate(184.000000, 0.000000)">
                            <path d="M18.3484435,2.85434733 C18.9875732,3.4934771 18.9875732,4.5297112 18.3484435,5.16884097 L6.89228444,16.625 L6.89228444,16.625 L0.653135024,10.4148723 C0.0140087228,9.77871888 0.0115986926,8.74490043 0.647752071,8.10577413 C0.648647137,8.10487488 0.64954325,8.10397668 0.65044041,8.10307952 C1.2902049,7.46331502 2.32692391,7.46155471 2.9688573,8.09914292 L6.89228444,11.9960127 L6.89228444,11.9960127 L16.0339498,2.85434733 C16.6730796,2.21521756 17.7093137,2.21521756 18.3484435,2.85434733 Z" id="arrow"></path>
                        </g>
                    </g>
                </g>
            </g>
        </g>
    </g>
</svg>