# WaveFront *.mtl file (generated by CINEMA 4D)

newmtl Gold
Kd 0.90508008003235 0.73807853460312 0.23707385361195
Ks 1 1 1
Ns 50
illum 7

newmtl Material.002
Kd 0.74696797132492 0.194625005126 0.194625005126
illum 7

newmtl eye
Kd 0 0 0
Ks 0.14844000339508 0.14844000339508 0.14844000339508
Ns 16
illum 7

newmtl Diamonds
Kd 1 1 1
illum 7

