%YAML 1.1
%TAG !u! tag:unity3d.com,2011:
--- !u!114 &11400000
MonoBehaviour:
  m_ObjectHideFlags: 0
  m_CorrespondingSourceObject: {fileID: 0}
  m_PrefabInstance: {fileID: 0}
  m_PrefabAsset: {fileID: 0}
  m_GameObject: {fileID: 0}
  m_Enabled: 1
  m_EditorHideFlags: 0
  m_Script: {fileID: 11500000, guid: 24e88b294eb04908bc2823f517b459bc, type: 3}
  m_Name: Level04
  m_EditorClassIdentifier: 
  _id: level04
  _sceneName: Level01
  _isTutorial: 0
  _bitSettings:
  - {fileID: 11400000, guid: d0901b7c6218f41fd9c73f2866b81014, type: 2}
  - {fileID: 11400000, guid: 8fa3dc435f96a4370b6bf7ed2635d4ff, type: 2}
  _boundStartNoisePercent: 0.15
  _speedDecreaseNoisePercent: 0.01
  _speedIncreaseNoisePercent: 0.06
  _difficultyDrillingHole: 250
  _drillAudioClip: {fileID: 8300000, guid: cd67cde73f0f74227b58ec27126eefb5, type: 3}
  _drillMaterialFirst: {fileID: 2100000, guid: 6abe47367ab384427827f4c054796a03, type: 2}
  _drillMaterialSecond: {fileID: 2100000, guid: b78aa6e3667294cc0af4cc7640f590cf, type: 2}
  _wall: {fileID: 8383692834781263053, guid: 3f037684fb22e4d7088a146ab756e2ee, type: 3}
  _tutorialSteps: []
