%YAML 1.1
%TAG !u! tag:unity3d.com,2011:
--- !u!114 &11400000
MonoBehaviour:
  m_ObjectHideFlags: 0
  m_CorrespondingSourceObject: {fileID: 0}
  m_PrefabInstance: {fileID: 0}
  m_PrefabAsset: {fileID: 0}
  m_GameObject: {fileID: 0}
  m_Enabled: 1
  m_EditorHideFlags: 0
  m_Script: {fileID: 11500000, guid: 9639e8cb3f814c3db60f4a1b2e5557e6, type: 3}
  m_Name: GameSettings
  m_EditorClassIdentifier: 
  _levels:
  - {fileID: 11400000, guid: 7bb5e2ddec07a4d0fb90ced8fccde5e3, type: 2}
  - {fileID: 11400000, guid: d8a5f012761d94c1a83d9fa20c90bff3, type: 2}
  - {fileID: 11400000, guid: 9395f076cdc5d42d893c219577aa7c38, type: 2}
  - {fileID: 11400000, guid: b1d9abe3ab4fe465ab5e2e58c63ca818, type: 2}
  - {fileID: 11400000, guid: 9c34d03429c7f4275943a6492a652788, type: 2}
  - {fileID: 11400000, guid: a01330045152d44818aaf359756db9cb, type: 2}
  _linkGooglePlay: https://www.google.com/
  _linkAppleStore: https://www.apple.com/
