%YAML 1.1
%TAG !u! tag:unity3d.com,2011:
--- !u!114 &11400000
MonoBehaviour:
  m_ObjectHideFlags: 0
  m_CorrespondingSourceObject: {fileID: 0}
  m_PrefabInstance: {fileID: 0}
  m_PrefabAsset: {fileID: 0}
  m_GameObject: {fileID: 0}
  m_Enabled: 1
  m_EditorHideFlags: 0
  m_Script: {fileID: 11500000, guid: 24e88b294eb04908bc2823f517b459bc, type: 3}
  m_Name: Level00
  m_EditorClassIdentifier: 
  _id: levelTutorial
  _sceneName: LevelTutorial
  _isTutorial: 1
  _bitSettings:
  - {fileID: 11400000, guid: d0901b7c6218f41fd9c73f2866b81014, type: 2}
  - {fileID: 11400000, guid: 8fa3dc435f96a4370b6bf7ed2635d4ff, type: 2}
  _boundStartNoisePercent: 1
  _speedDecreaseNoisePercent: 0
  _speedIncreaseNoisePercent: 0.15
  _difficultyDrillingHole: 300
  _drillAudioClip: {fileID: 8300000, guid: b1168d1cd2b144a478c1543ba334f8f2, type: 3}
  _drillMaterialFirst: {fileID: 2100000, guid: 2da2e11861b3e4a4581d68a432065977, type: 2}
  _drillMaterialSecond: {fileID: 2100000, guid: b78aa6e3667294cc0af4cc7640f590cf, type: 2}
  _wall: {fileID: 5664898948170510072, guid: 2443025ee43b04fa08287bef905d4613, type: 3}
  _tutorialSteps: []
