load("./pwm_lookup_table.mat")

thrusts_to_sub = [ 1.000000 1.000000  0.000000  0.000000  0.000000  0.000000;
                   0.000000 -0.000000 -0.500000  0.500000 -0.500000  0.500000;
                   0.000000  0.000000  0.866025  0.866025 -0.866025 -0.866025;
                   0.000000  0.000000  0.433013 -0.433013 -0.433013  0.433013;
                   0.000000  0.000000 -0.519615 -0.519615 -0.346410 -0.346410;
                  -0.550000  0.550000 -0.300000  0.300000  0.200000 -0.200000;];
              
sub_to_thrusts = [ 0.500000  0.090909 -0.000000 -0.524864  0.000000 -0.909091;
                   0.500000 -0.090909  0.000000  0.524864  0.000000  0.909091;
                   0.000000 -0.500000  0.230940  0.577350 -0.577350 -0.000000;
                  -0.000000  0.500000  0.230940 -0.577350 -0.577350  0.000000;
                  -0.000000 -0.500000 -0.346410 -0.577350 -0.577350 -0.000000;
                   0.000000  0.500000 -0.346410  0.577350 -0.577350  0.000000;];