<?xml version="1.0" encoding="utf-8"?>
<!-- Generator: Adobe Illustrator 16.0.0, SVG Export Plug-In . SVG Version: 6.00 Build 0)  -->
<!DOCTYPE svg PUBLIC "-//W3C//DTD SVG 1.1//EN" "http://www.w3.org/Graphics/SVG/1.1/DTD/svg11.dtd">
<svg version="1.1" id="Layer_1" xmlns="http://www.w3.org/2000/svg" xmlns:xlink="http://www.w3.org/1999/xlink" x="0px" y="0px"
	 width="864px" height="864px" viewBox="0 0 864 864" enable-background="new 0 0 864 864" xml:space="preserve">
<g>
	<defs>
		<rect id="SVGID_1_" width="864" height="864"/>
	</defs>
	<clipPath id="SVGID_2_">
		<use xlink:href="#SVGID_1_"  overflow="visible"/>
	</clipPath>
	<path clip-path="url(#SVGID_2_)" fill="#0071BC" d="M432,864C193.413,864,0,670.587,0,432S193.413,0,432,0s432,193.413,432,432
		S670.587,864,432,864"/>
	<path clip-path="url(#SVGID_2_)" fill="#F2F2F2" d="M569.5,148.5h-269c-13.807,0-25,11.193-25,25v508c0,13.807,11.193,25,25,25h269
		c13.807,0,25-11.193,25-25v-508C594.5,159.693,583.307,148.5,569.5,148.5 M465.5,171.5h0.911c1.307,0,2.547,0.786,2.938,2.033
		c0.648,2.068-0.878,3.967-2.849,3.967h-0.911c-1.307,0-2.547-0.786-2.938-2.033C462.003,173.399,463.529,171.5,465.5,171.5
		 M405.5,171.5h46.911c1.307,0,2.547,0.786,2.938,2.033c0.648,2.068-0.878,3.967-2.849,3.967h-46.911
		c-1.307,0-2.547-0.786-2.938-2.033C402.003,173.399,403.529,171.5,405.5,171.5 M433.447,676.423
		c-14.788,1.166-27.036-11.082-25.87-25.87c0.917-11.634,10.342-21.059,21.976-21.976c14.788-1.166,27.036,11.082,25.87,25.87
		C454.506,666.081,445.081,675.506,433.447,676.423 M578.5,597.166c0,4.603-3.731,8.334-8.334,8.334H300.833
		c-4.603,0-8.333-3.73-8.333-8.333V221.834c0-4.603,3.731-8.334,8.334-8.334h269.333c4.603,0,8.333,3.73,8.333,8.333V597.166z"/>
	<path clip-path="url(#SVGID_2_)" fill="#F2F2F2" d="M544,260.5H325c-4.125,0-7.5-3.375-7.5-7.5s3.375-7.5,7.5-7.5h219
		c4.125,0,7.5,3.375,7.5,7.5S548.125,260.5,544,260.5"/>
	<path clip-path="url(#SVGID_2_)" fill="#F2F2F2" d="M544,305.5H325c-4.125,0-7.5-3.375-7.5-7.5s3.375-7.5,7.5-7.5h219
		c4.125,0,7.5,3.375,7.5,7.5S548.125,305.5,544,305.5"/>
	<path clip-path="url(#SVGID_2_)" fill="#F2F2F2" d="M483,350.5H380c-4.125,0-7.5-3.375-7.5-7.5s3.375-7.5,7.5-7.5h103
		c4.125,0,7.5,3.375,7.5,7.5S487.125,350.5,483,350.5"/>
	<path clip-path="url(#SVGID_2_)" fill="#F2F2F2" d="M208.5,446.5c0-8.284,6.716-15,15-15s15,6.716,15,15s-6.716,15-15,15
		S208.5,454.784,208.5,446.5"/>
	<path clip-path="url(#SVGID_2_)" fill="#F2F2F2" d="M208.5,492.5c0-8.284,6.716-15,15-15s15,6.716,15,15s-6.716,15-15,15
		S208.5,500.784,208.5,492.5"/>
	<path clip-path="url(#SVGID_2_)" fill="#F2F2F2" d="M208.5,538.5c0-8.284,6.716-15,15-15s15,6.716,15,15s-6.716,15-15,15
		S208.5,546.784,208.5,538.5"/>
</g>
</svg>
