<?xml version="1.0" encoding="utf-8"?>
<!-- Generator: Adobe Illustrator 16.0.0, SVG Export Plug-In . SVG Version: 6.00 Build 0)  -->
<!DOCTYPE svg PUBLIC "-//W3C//DTD SVG 1.1//EN" "http://www.w3.org/Graphics/SVG/1.1/DTD/svg11.dtd">
<svg version="1.1" id="Layer_1" xmlns="http://www.w3.org/2000/svg" xmlns:xlink="http://www.w3.org/1999/xlink" x="0px" y="0px"
	 width="864px" height="864px" viewBox="0 0 864 864" enable-background="new 0 0 864 864" xml:space="preserve">
<g>
	<defs>
		<rect id="SVGID_1_" width="864" height="864"/>
	</defs>
	<clipPath id="SVGID_2_">
		<use xlink:href="#SVGID_1_"  overflow="visible"/>
	</clipPath>
	<g clip-path="url(#SVGID_2_)">
		<defs>
			<rect id="SVGID_3_" width="864" height="864"/>
		</defs>
		<clipPath id="SVGID_4_">
			<use xlink:href="#SVGID_3_"  overflow="visible"/>
		</clipPath>
		<path clip-path="url(#SVGID_4_)" fill="#662D91" d="M432,864C193.413,864,0,670.587,0,432S193.413,0,432,0s432,193.413,432,432
			S670.587,864,432,864"/>
		<g opacity="0.38" clip-path="url(#SVGID_4_)">
			<g>
				<defs>
					<rect id="SVGID_5_" x="184.024" y="175.024" width="502.952" height="502.952"/>
				</defs>
				<clipPath id="SVGID_6_">
					<use xlink:href="#SVGID_5_"  overflow="visible"/>
				</clipPath>
				
					<ellipse transform="matrix(0.7071 -0.7071 0.7071 0.7071 -174.0261 432.864)" clip-path="url(#SVGID_6_)" fill="none" stroke="#F2F2F2" stroke-width="30" stroke-miterlimit="10" cx="435.5" cy="426.5" rx="98.501" ry="319.501"/>
			</g>
		</g>
		<g opacity="0.38" clip-path="url(#SVGID_4_)">
			<g>
				<defs>
					<rect id="SVGID_7_" x="184.024" y="175.024" width="502.952" height="502.952"/>
				</defs>
				<clipPath id="SVGID_8_">
					<use xlink:href="#SVGID_7_"  overflow="visible"/>
				</clipPath>
				
					<ellipse transform="matrix(0.7071 0.7071 -0.7071 0.7071 429.136 -183.0261)" clip-path="url(#SVGID_8_)" fill="none" stroke="#F2F2F2" stroke-width="30" stroke-miterlimit="10" cx="435.5" cy="426.5" rx="98.501" ry="319.501"/>
			</g>
		</g>
		<path clip-path="url(#SVGID_4_)" fill="#FFFFFF" d="M378,427c0-32.032,25.968-58,58-58s58,25.968,58,58s-25.968,58-58,58
			S378,459.032,378,427"/>
	</g>
</g>
</svg>
