<?xml version="1.0" encoding="utf-8"?>
<!-- Generator: Adobe Illustrator 16.0.0, SVG Export Plug-In . SVG Version: 6.00 Build 0)  -->
<!DOCTYPE svg PUBLIC "-//W3C//DTD SVG 1.1//EN" "http://www.w3.org/Graphics/SVG/1.1/DTD/svg11.dtd">
<svg version="1.1" id="Layer_1" xmlns="http://www.w3.org/2000/svg" xmlns:xlink="http://www.w3.org/1999/xlink" x="0px" y="0px"
	 width="864px" height="864px" viewBox="0 0 864 864" enable-background="new 0 0 864 864" xml:space="preserve">
<g>
	<defs>
		<rect id="SVGID_1_" width="864" height="864"/>
	</defs>
	<clipPath id="SVGID_2_">
		<use xlink:href="#SVGID_1_"  overflow="visible"/>
	</clipPath>
	<g clip-path="url(#SVGID_2_)">
		<defs>
			<rect id="SVGID_3_" width="864" height="864"/>
		</defs>
		<clipPath id="SVGID_4_">
			<use xlink:href="#SVGID_3_"  overflow="visible"/>
		</clipPath>
		<path clip-path="url(#SVGID_4_)" fill="#22B573" d="M432,864C193.413,864,0,670.587,0,432S193.413,0,432,0s432,193.413,432,432
			S670.587,864,432,864"/>
		<g opacity="0.91" clip-path="url(#SVGID_4_)">
			<g>
				<defs>
					<rect id="SVGID_5_" x="152.5" y="291.5" width="572" height="286"/>
				</defs>
				<clipPath id="SVGID_6_">
					<use xlink:href="#SVGID_5_"  overflow="visible"/>
				</clipPath>
				<path clip-path="url(#SVGID_6_)" fill="#FFFFFF" d="M581.501,291.5H299.256c-73.404,0-137.807,53.775-145.857,126.736
					C143.882,504.496,211.166,577.5,295.5,577.5c29.058,0,56.08-8.678,78.641-23.572c9.122-6.021,19.704-9.428,30.634-9.428
					l67.477,0.001c10.941,0,21.521,3.434,30.654,9.458c24.706,16.296,54.759,25.141,86.973,23.302
					c69.051-3.942,131.784-67.872,134.507-136.981C727.601,358.67,662.395,291.5,581.501,291.5 M339.651,444.701h-22.996
					c-4.717,0-8.542,3.824-8.542,8.542v22.996c0,12.612-11.255,22.724-24.216,20.786c-10.609-1.586-17.834-11.754-17.834-22.482
					v-21.3c0-4.718-3.825-8.542-8.542-8.542h-22.996c-12.612,0-22.724-11.254-20.786-24.216
					c1.586-10.609,11.755-17.835,22.482-17.835h20.775c5.007,0,9.067-4.058,9.067-9.066v-22.471
					c0-12.613,11.254-22.723,24.216-20.786c10.609,1.586,17.834,11.755,17.834,22.482v21.3c0,4.717,3.825,8.541,8.542,8.541h21.3
					c10.728,0,20.897,7.226,22.482,17.835C362.375,433.447,352.263,444.701,339.651,444.701 M432.119,444.028
					c-2.992,1.925-7.015,1.052-8.94-1.941l-20.997-32.646c-1.925-2.992-1.052-7.015,1.941-8.941c2.993-1.924,7.016-1.051,8.94,1.941
					l20.998,32.647C435.985,438.08,435.112,442.104,432.119,444.028 M464.466,444.028c-2.993,1.925-7.016,1.052-8.94-1.941
					l-20.997-32.646c-1.926-2.992-1.052-7.015,1.94-8.941c2.993-1.924,7.017-1.051,8.941,1.941l20.997,32.647
					C468.332,438.08,467.458,442.104,464.466,444.028 M538.239,447.71c-13.273,0-24.033-10.761-24.033-24.034
					c0-13.274,10.76-24.033,24.033-24.033s24.034,10.759,24.034,24.033C562.273,436.949,551.513,447.71,538.239,447.71
					 M589.912,499.383c-13.274,0-24.034-10.761-24.034-24.034s10.76-24.034,24.034-24.034c13.272,0,24.033,10.761,24.033,24.034
					S603.185,499.383,589.912,499.383 M589.912,396.037c-13.274,0-24.034-10.76-24.034-24.033s10.76-24.033,24.034-24.033
					c13.272,0,24.033,10.76,24.033,24.033S603.185,396.037,589.912,396.037 M641.584,447.71c-13.273,0-24.034-10.761-24.034-24.034
					c0-13.274,10.761-24.033,24.034-24.033s24.034,10.759,24.034,24.033C665.618,436.949,654.857,447.71,641.584,447.71"/>
			</g>
		</g>
	</g>
</g>
</svg>
