{
  "type": "service_account",
  "project_id": "bisad-300c1",
  "private_key_id": "39d92da570424a1fbb71c21f5b61d66dc9d1b627",
  "private_key": "-----BEGIN PRIVATE KEY-----\nMIIEvQIBADANBgkqhkiG9w0BAQEFAASCBKcwggSjAgEAAoIBAQDidBed2IT9M254\nCqvXKw+xw3XkQd+7PZMtqVCLGQPmlIEZ4Qia+TajC+9JYEe49Y4dK/kjn9f44n69\nQhHOGdDa1A+uERlfHfz4lArSZmiit0r07HpdYkpj0OyZxdAo0Zl39HqDFC4kVjtA\nFnIJssx+HSIG4+oNzwR+dOOGv5klkSY3FYAGqrXmMou5XjST9qClvIYdOyZ/4irs\nc56wnhdKR/QrCRm9lnewZni3FuFbmqeYZAKVGcN3+rcV+ri5ck1VxDY0jLar69gC\nHuB4GKVciAbdjSXKI1+CPvkH+1sBTldoERcinYisjViOn+YnS92ijIpdMtC41slD\nxHv9MxxJAgMBAAECggEAKMMOZDiO+bfKDPwYwf6rkMs2+5sa72yOQ1Qcnikm0VjO\nY07lOmYdHly92halWmcDCX+6lR3G5bM5bo5Hv7JYbKdq2iGUUFGI0WLujsBl2dJG\nAQ/XF9ujOdPn3ucjSNGvvw6oBdO6WYqXGDpiFRpU4meSkixw20L2E2Ate3oeEkt3\nY6BFGS7OV0TYhN+q5xmNVul3IMunth9InRDhwjlcMq6mvuzeCH+j+bVS+vtLXd3S\ntSrM4D/94lyGw6m4YTK255j2wNyCfp8oswGGcsYPI4FJkfE/yiUfllaouSeEBBgY\nZPmr1nEJvTMxJcV/nTvxY0mfrrGxEDOIR2IYr8x0jQKBgQD1oH8/Gc6mbdhHTTRo\n+Xzs1ijEUEYksMl0ICK6yfQn4enowayG6jpftfcUUtsGnrZPWWUGEF2xibXi10M4\ndZmeVCupTjcEof9FBXrvDTESH/Gty7D7EEQktHGo8PP7I6brUzMlxcYk1kI4r+w9\ndi275/Hl3KK8lDoUHkDACa+qXQKBgQDsBE8BNP7V6Y0fW6k+fNESTYA26iemwF3+\nlR6vALf0pcST0lviq+ojLeBCg+Z5v2ZU2aAlqu+/cB+ew7NAjY/zar1UyltJXJW8\ni8IiqUoAXnry7JIq0K532tKXGtDbru33dDa903YNWTM9lElInfGX7Fpl0rg9z6Ee\nZc/FyLSS3QKBgBw222b8J+imJXnLPIHyZo8t6nDiZ6w/QmS8bEDYgdsy8BN0a8Tz\nktD7re3/tnkEMhzbP+d6acjC8MmlwGrz1zmAoaNJALjfgtsCziQ3d7OFR9WW2DV+\noNU2hPfK9bubVMkjPXTRSvlgQysPyislMAutkPO+bFMNE77L2tQ0SKFhAoGABalE\ny96djjv/6pSkRp9v1GSPgsGzGcjbeFPTXJdD0lZ3lKQjGBjPkPB0xKOtT5ZLuhVO\nRhkHjyv9Vi2TiyTaIxiYWgRQlD3oSZGAopw07jVV9aW/C8/dn3pcOsul3t8fTiQ3\ne+4qkr9k/0EjUN6ZAO/mazLWwITOdJA0n6XkzvECgYEA659pZk2N7099066HuQAL\nCFOi6pB5pZ/2kVsgR+hixwlVOYwmUX5KDf9W89lY1IraG7PL0qpo9bz+RrDTyXRb\n6WuSdP6M6mpR/JXP4S4lvqdDStJDtkd4Weg99fXdWpZwEqIL3HIx0ZMWImn80Bnc\nSwlXbHPehEV2JjQsNuKWL1I=\n-----END PRIVATE KEY-----\n",
  "client_email": "firebase-adminsdk-dqw30@bisad-300c1.iam.gserviceaccount.com",
  "client_id": "109415558583834422301",
  "auth_uri": "https://accounts.google.com/o/oauth2/auth",
  "token_uri": "https://oauth2.googleapis.com/token",
  "auth_provider_x509_cert_url": "https://www.googleapis.com/oauth2/v1/certs",
  "client_x509_cert_url": "https://www.googleapis.com/robot/v1/metadata/x509/firebase-adminsdk-dqw30%40bisad-300c1.iam.gserviceaccount.com"
}
