[
  {
    "id": 1,
    "name": "Youspan",
    "companyLogo": "http://dummyimage.com/148x100.png/dddddd/000000",
    "url": "https://redcross.org/ut.xml?odio=nec&justo=euismod&sollicitudin=scelerisque&ut=quam&suscipit=turpis&a=adipiscing&feugiat=lorem&et=vitae&eros=mattis&vestibulum=nibh&ac=ligula&est=nec&lacinia=sem&nisi=duis&venenatis=aliquam&tristique=convallis&fusce=nunc",
    "location": "98484 Spenser Court",
    "domainAddress": "eepurl.com",
    "details": "Maecenas pulvinar lobortis est. Phasellus sit amet erat. Nulla tempus. Vivamus in felis eu sapien cursus vestibulum.",
    "description": "Nulla mollis molestie lorem. Quisque ut erat. Curabitur gravida nisi at nibh. In hac habitasse platea dictumst. Aliquam augue quam, sollicitudin vitae, consectetuer eget, rutrum at, lorem.",
    "approvalStatus": true,
    "numberOfVacancies": 1,
    "interviewsAreScheduled": 1
  },
  {
    "id": 2,
    "name": "Eazzy",
    "companyLogo": "http://dummyimage.com/139x100.png/cc0000/ffffff",
    "url": "https://telegraph.co.uk/cubilia/curae/duis.aspx?vestibulum=sit&eget=amet&vulputate=sem&ut=fusce&ultrices=consequat&vel=nulla&augue=nisl&vestibulum=nunc&ante=nisl&ipsum=duis&primis=bibendum&in=felis&faucibus=sed&orci=interdum&luctus=venenatis&et=turpis&ultrices=enim&posuere=blandit",
    "location": "64 Sunbrook Parkway",
    "domainAddress": "csmonitor.com",
    "details": "Vivamus vestibulum sagittis sapien. Cum sociis natoque penatibus et magnis dis parturient montes, nascetur ridiculus mus. Etiam vel augue. Vestibulum rutrum rutrum neque. Aenean auctor gravida sem. Praesent id massa id nisl venenatis lacinia.",
    "description": "Integer tincidunt ante vel ipsum. Praesent blandit lacinia erat. Vestibulum sed magna at nunc commodo placerat. Praesent blandit. Nam nulla. Integer pede justo, lacinia eget, tincidunt eget, tempus vel, pede.",
    "approvalStatus": true,
    "numberOfVacancies": 2,
    "interviewsAreScheduled": 2
  },
  {
    "id": 3,
    "name": "Bubblebox",
    "companyLogo": "http://dummyimage.com/167x100.png/ff4444/ffffff",
    "url": "http://shareasale.com/ornare/consequat/lectus.jsp?odio=est&cras=et&mi=tempus&pede=semper&malesuada=est&in=quam&imperdiet=pharetra&et=magna&commodo=ac",
    "location": "93850 Raven Junction",
    "domainAddress": "sakura.ne.jp",
    "details": "Praesent lectus. Vestibulum quam sapien, varius ut, blandit non, interdum in, ante. Vestibulum ante ipsum primis in faucibus orci luctus et ultrices posuere cubilia Curae; Duis faucibus accumsan odio. Curabitur convallis.",
    "description": "Sed sagittis. Nam congue, risus semper porta volutpat, quam pede lobortis ligula, sit amet eleifend pede libero quis orci. Nullam molestie nibh in lectus. Pellentesque at nulla. Suspendisse potenti. Cras in purus eu magna vulputate luctus. Cum sociis natoque penatibus et magnis dis parturient montes, nascetur ridiculus mus. Vivamus vestibulum sagittis sapien. Cum sociis natoque penatibus et magnis dis parturient montes, nascetur ridiculus mus. Etiam vel augue.",
    "approvalStatus": true,
    "numberOfVacancies": 3,
    "interviewsAreScheduled": 3
  },
  {
    "id": 4,
    "name": "Wordpedia",
    "companyLogo": "http://dummyimage.com/226x100.png/5fa2dd/ffffff",
    "url": "https://ca.gov/phasellus/sit/amet/erat/nulla/tempus/vivamus.html?ultrices=vulputate&phasellus=justo&id=in&sapien=blandit&in=ultrices&sapien=enim&iaculis=lorem&congue=ipsum&vivamus=dolor&metus=sit&arcu=amet&adipiscing=consectetuer&molestie=adipiscing&hendrerit=elit&at=proin&vulputate=interdum&vitae=mauris&nisl=non&aenean=ligula&lectus=pellentesque&pellentesque=ultrices&eget=phasellus&nunc=id&donec=sapien&quis=in&orci=sapien&eget=iaculis&orci=congue&vehicula=vivamus&condimentum=metus&curabitur=arcu&in=adipiscing&libero=molestie&ut=hendrerit&massa=at&volutpat=vulputate&convallis=vitae&morbi=nisl&odio=aenean&odio=lectus&elementum=pellentesque&eu=eget&interdum=nunc&eu=donec&tincidunt=quis&in=orci&leo=eget&maecenas=orci&pulvinar=vehicula&lobortis=condimentum&est=curabitur&phasellus=in&sit=libero&amet=ut&erat=massa&nulla=volutpat&tempus=convallis&vivamus=morbi&in=odio&felis=odio&eu=elementum&sapien=eu&cursus=interdum&vestibulum=eu&proin=tincidunt&eu=in&mi=leo",
    "location": "0299 Waxwing Avenue",
    "domainAddress": "posterous.com",
    "details": "Quisque porta volutpat erat. Quisque erat eros, viverra eget, congue eget, semper rutrum, nulla. Nunc purus. Phasellus in felis. Donec semper sapien a libero.",
    "description": "Phasellus in felis. Donec semper sapien a libero. Nam dui. Proin leo odio, porttitor id, consequat in, consequat ut, nulla. Sed accumsan felis. Ut at dolor quis odio consequat varius. Integer ac leo. Pellentesque ultrices mattis odio. Donec vitae nisi.",
    "approvalStatus": false,
    "numberOfVacancies": 4,
    "interviewsAreScheduled": 4
  },
  {
    "id": 5,
    "name": "Yodel",
    "companyLogo": "http://dummyimage.com/121x100.png/5fa2dd/ffffff",
    "url": "http://addthis.com/orci/eget/orci.xml?leo=morbi&pellentesque=a&ultrices=ipsum&mattis=integer&odio=a&donec=nibh&vitae=in&nisi=quis&nam=justo&ultrices=maecenas&libero=rhoncus&non=aliquam&mattis=lacus&pulvinar=morbi&nulla=quis&pede=tortor&ullamcorper=id&augue=nulla&a=ultrices&suscipit=aliquet&nulla=maecenas&elit=leo&ac=odio&nulla=condimentum&sed=id&vel=luctus&enim=nec&sit=molestie&amet=sed&nunc=justo&viverra=pellentesque&dapibus=viverra&nulla=pede&suscipit=ac&ligula=diam&in=cras&lacus=pellentesque&curabitur=volutpat&at=dui&ipsum=maecenas&ac=tristique&tellus=est",
    "location": "98134 Washington Center",
    "domainAddress": "reuters.com",
    "details": "Donec posuere metus vitae ipsum. Aliquam non mauris. Morbi non lectus.",
    "description": "Vestibulum rutrum rutrum neque. Aenean auctor gravida sem. Praesent id massa id nisl venenatis lacinia. Aenean sit amet justo.",
    "approvalStatus": false,
    "numberOfVacancies": 5,
    "interviewsAreScheduled": 5
  },
  {
    "id": 6,
    "name": "Demizz",
    "companyLogo": "http://dummyimage.com/156x100.png/5fa2dd/ffffff",
    "url": "https://chicagotribune.com/vestibulum/eget/vulputate/ut.jpg?lorem=quam&ipsum=sollicitudin&dolor=vitae&sit=consectetuer&amet=eget&consectetuer=rutrum&adipiscing=at&elit=lorem&proin=integer&risus=tincidunt&praesent=ante&lectus=vel&vestibulum=ipsum&quam=praesent&sapien=blandit&varius=lacinia&ut=erat&blandit=vestibulum&non=sed&interdum=magna&in=at&ante=nunc&vestibulum=commodo&ante=placerat&ipsum=praesent&primis=blandit&in=nam&faucibus=nulla&orci=integer&luctus=pede&et=justo&ultrices=lacinia&posuere=eget&cubilia=tincidunt&curae=eget",
    "location": "734 Nancy Crossing",
    "domainAddress": "t-online.de",
    "details": "Nulla suscipit ligula in lacus. Curabitur at ipsum ac tellus semper interdum. Mauris ullamcorper purus sit amet nulla. Quisque arcu libero, rutrum ac, lobortis vel, dapibus at, diam.",
    "description": "Nulla facilisi. Cras non velit nec nisi vulputate nonummy. Maecenas tincidunt lacus at velit. Vivamus vel nulla eget eros elementum pellentesque. Quisque porta volutpat erat. Quisque erat eros, viverra eget, congue eget, semper rutrum, nulla. Nunc purus.",
    "approvalStatus": false,
    "numberOfVacancies": 6,
    "interviewsAreScheduled": 6
  },
  {
    "id": 7,
    "name": "Demizz",
    "companyLogo": "http://dummyimage.com/191x100.png/ff4444/ffffff",
    "url": "https://vkontakte.ru/vivamus/vel/nulla/eget/eros/elementum.png?arcu=magna&adipiscing=ac&molestie=consequat&hendrerit=metus&at=sapien&vulputate=ut&vitae=nunc&nisl=vestibulum&aenean=ante&lectus=ipsum&pellentesque=primis&eget=in&nunc=faucibus&donec=orci&quis=luctus&orci=et&eget=ultrices&orci=posuere&vehicula=cubilia&condimentum=curae&curabitur=mauris&in=viverra&libero=diam&ut=vitae&massa=quam&volutpat=suspendisse&convallis=potenti&morbi=nullam&odio=porttitor&odio=lacus&elementum=at&eu=turpis&interdum=donec&eu=posuere&tincidunt=metus&in=vitae&leo=ipsum&maecenas=aliquam&pulvinar=non&lobortis=mauris&est=morbi&phasellus=non&sit=lectus&amet=aliquam&erat=sit&nulla=amet&tempus=diam&vivamus=in&in=magna&felis=bibendum&eu=imperdiet&sapien=nullam&cursus=orci&vestibulum=pede&proin=venenatis&eu=non&mi=sodales&nulla=sed&ac=tincidunt&enim=eu",
    "location": "42442 Becker Court",
    "domainAddress": "1und1.de",
    "details": "Cras non velit nec nisi vulputate nonummy. Maecenas tincidunt lacus at velit. Vivamus vel nulla eget eros elementum pellentesque. Quisque porta volutpat erat. Quisque erat eros, viverra eget, congue eget, semper rutrum, nulla. Nunc purus.",
    "description": "Mauris ullamcorper purus sit amet nulla.",
    "approvalStatus": true,
    "numberOfVacancies": 7,
    "interviewsAreScheduled": 7
  },
  {
    "id": 8,
    "name": "Skinder",
    "companyLogo": "http://dummyimage.com/137x100.png/5fa2dd/ffffff",
    "url": "http://list-manage.com/interdum/mauris/non.aspx?fusce=viverra&lacus=pede&purus=ac&aliquet=diam&at=cras&feugiat=pellentesque&non=volutpat&pretium=dui&quis=maecenas&lectus=tristique&suspendisse=est&potenti=et&in=tempus&eleifend=semper&quam=est&a=quam&odio=pharetra&in=magna&hac=ac&habitasse=consequat&platea=metus&dictumst=sapien&maecenas=ut&ut=nunc&massa=vestibulum&quis=ante&augue=ipsum&luctus=primis&tincidunt=in&nulla=faucibus&mollis=orci&molestie=luctus&lorem=et&quisque=ultrices&ut=posuere&erat=cubilia&curabitur=curae&gravida=mauris&nisi=viverra&at=diam&nibh=vitae&in=quam&hac=suspendisse&habitasse=potenti&platea=nullam&dictumst=porttitor&aliquam=lacus&augue=at&quam=turpis&sollicitudin=donec&vitae=posuere&consectetuer=metus&eget=vitae&rutrum=ipsum&at=aliquam&lorem=non&integer=mauris&tincidunt=morbi&ante=non&vel=lectus&ipsum=aliquam&praesent=sit&blandit=amet&lacinia=diam&erat=in&vestibulum=magna&sed=bibendum&magna=imperdiet&at=nullam&nunc=orci&commodo=pede&placerat=venenatis&praesent=non&blandit=sodales&nam=sed&nulla=tincidunt&integer=eu&pede=felis&justo=fusce&lacinia=posuere&eget=felis&tincidunt=sed&eget=lacus&tempus=morbi&vel=sem&pede=mauris&morbi=laoreet&porttitor=ut&lorem=rhoncus&id=aliquet&ligula=pulvinar&suspendisse=sed&ornare=nisl&consequat=nunc&lectus=rhoncus&in=dui&est=vel&risus=sem&auctor=sed",
    "location": "284 Corben Parkway",
    "domainAddress": "blogtalkradio.com",
    "details": "Fusce consequat. Nulla nisl. Nunc nisl. Duis bibendum, felis sed interdum venenatis, turpis enim blandit mi, in porttitor pede justo eu massa.",
    "description": "Nullam orci pede, venenatis non, sodales sed, tincidunt eu, felis. Fusce posuere felis sed lacus. Morbi sem mauris, laoreet ut, rhoncus aliquet, pulvinar sed, nisl. Nunc rhoncus dui vel sem. Sed sagittis. Nam congue, risus semper porta volutpat, quam pede lobortis ligula, sit amet eleifend pede libero quis orci. Nullam molestie nibh in lectus. Pellentesque at nulla. Suspendisse potenti. Cras in purus eu magna vulputate luctus.",
    "approvalStatus": true,
    "numberOfVacancies": 8,
    "interviewsAreScheduled": 8
  },
  {
    "id": 9,
    "name": "Edgetag",
    "companyLogo": "http://dummyimage.com/204x100.png/dddddd/000000",
    "url": "http://nba.com/at/turpis/a.aspx?sem=tellus&duis=nisi&aliquam=eu&convallis=orci&nunc=mauris&proin=lacinia&at=sapien&turpis=quis&a=libero&pede=nullam&posuere=sit",
    "location": "117 Twin Pines Junction",
    "domainAddress": "com.com",
    "details": "In hac habitasse platea dictumst. Etiam faucibus cursus urna. Ut tellus.",
    "description": "Fusce congue, diam id ornare imperdiet, sapien urna pretium nisl, ut volutpat sapien arcu sed augue. Aliquam erat volutpat.",
    "approvalStatus": false,
    "numberOfVacancies": 9,
    "interviewsAreScheduled": 9
  },
  {
    "id": 10,
    "name": "Fivespan",
    "companyLogo": "http://dummyimage.com/216x100.png/dddddd/000000",
    "url": "https://hexun.com/hac/habitasse/platea.jsp?dui=imperdiet&proin=sapien&leo=urna&odio=pretium&porttitor=nisl&id=ut&consequat=volutpat&in=sapien&consequat=arcu&ut=sed&nulla=augue&sed=aliquam&accumsan=erat&felis=volutpat&ut=in&at=congue&dolor=etiam&quis=justo&odio=etiam&consequat=pretium&varius=iaculis&integer=justo&ac=in&leo=hac&pellentesque=habitasse&ultrices=platea&mattis=dictumst&odio=etiam&donec=faucibus&vitae=cursus&nisi=urna&nam=ut",
    "location": "9959 Utah Circle",
    "domainAddress": "nih.gov",
    "details": "Suspendisse accumsan tortor quis turpis. Sed ante. Vivamus tortor. Duis mattis egestas metus. Aenean fermentum. Donec ut mauris eget massa tempor convallis. Nulla neque libero, convallis eget, eleifend luctus, ultricies eu, nibh. Quisque id justo sit amet sapien dignissim vestibulum.",
    "description": "Fusce congue, diam id ornare imperdiet, sapien urna pretium nisl, ut volutpat sapien arcu sed augue. Aliquam erat volutpat. In congue. Etiam justo. Etiam pretium iaculis justo. In hac habitasse platea dictumst. Etiam faucibus cursus urna. Ut tellus. Nulla ut erat id mauris vulputate elementum. Nullam varius.",
    "approvalStatus": true,
    "numberOfVacancies": 10,
    "interviewsAreScheduled": 10
  },
  {
    "id": 11,
    "name": "Reallinks",
    "companyLogo": "http://dummyimage.com/106x100.png/5fa2dd/ffffff",
    "url": "http://wix.com/in/libero/ut/massa/volutpat/convallis.jpg?luctus=iaculis&et=justo&ultrices=in&posuere=hac&cubilia=habitasse&curae=platea&donec=dictumst&pharetra=etiam&magna=faucibus&vestibulum=cursus&aliquet=urna&ultrices=ut&erat=tellus&tortor=nulla&sollicitudin=ut&mi=erat&sit=id&amet=mauris&lobortis=vulputate&sapien=elementum&sapien=nullam&non=varius&mi=nulla&integer=facilisi&ac=cras&neque=non&duis=velit&bibendum=nec&morbi=nisi&non=vulputate&quam=nonummy&nec=maecenas&dui=tincidunt&luctus=lacus&rutrum=at&nulla=velit&tellus=vivamus&in=vel&sagittis=nulla&dui=eget&vel=eros&nisl=elementum&duis=pellentesque&ac=quisque&nibh=porta&fusce=volutpat&lacus=erat&purus=quisque&aliquet=erat&at=eros&feugiat=viverra&non=eget&pretium=congue&quis=eget",
    "location": "12343 Burning Wood Crossing",
    "domainAddress": "earthlink.net",
    "details": "Duis consequat dui nec nisi volutpat eleifend.",
    "description": "Vestibulum ante ipsum primis in faucibus orci luctus et ultrices posuere cubilia Curae; Mauris viverra diam vitae quam. Suspendisse potenti. Nullam porttitor lacus at turpis. Donec posuere metus vitae ipsum. Aliquam non mauris. Morbi non lectus. Aliquam sit amet diam in magna bibendum imperdiet.",
    "approvalStatus": false,
    "numberOfVacancies": 11,
    "interviewsAreScheduled": 11
  },
  {
    "id": 12,
    "name": "Demimbu",
    "companyLogo": "http://dummyimage.com/196x100.png/cc0000/ffffff",
    "url": "https://github.com/turpis/elementum/ligula/vehicula.xml?ante=erat&ipsum=vestibulum&primis=sed&in=magna&faucibus=at&orci=nunc&luctus=commodo&et=placerat&ultrices=praesent&posuere=blandit&cubilia=nam&curae=nulla&duis=integer&faucibus=pede&accumsan=justo&odio=lacinia&curabitur=eget&convallis=tincidunt&duis=eget&consequat=tempus&dui=vel&nec=pede&nisi=morbi&volutpat=porttitor&eleifend=lorem&donec=id&ut=ligula&dolor=suspendisse&morbi=ornare&vel=consequat&lectus=lectus&in=in&quam=est&fringilla=risus&rhoncus=auctor&mauris=sed&enim=tristique&leo=in&rhoncus=tempus&sed=sit&vestibulum=amet&sit=sem&amet=fusce&cursus=consequat&id=nulla&turpis=nisl&integer=nunc&aliquet=nisl&massa=duis&id=bibendum&lobortis=felis&convallis=sed&tortor=interdum&risus=venenatis&dapibus=turpis&augue=enim&vel=blandit&accumsan=mi&tellus=in&nisi=porttitor&eu=pede&orci=justo&mauris=eu&lacinia=massa&sapien=donec&quis=dapibus&libero=duis&nullam=at&sit=velit&amet=eu&turpis=est&elementum=congue&ligula=elementum&vehicula=in&consequat=hac&morbi=habitasse&a=platea",
    "location": "68338 Messerschmidt Park",
    "domainAddress": "yelp.com",
    "details": "Integer a nibh. In quis justo. Maecenas rhoncus aliquam lacus. Morbi quis tortor id nulla ultrices aliquet. Maecenas leo odio, condimentum id, luctus nec, molestie sed, justo.",
    "description": "Duis bibendum, felis sed interdum venenatis, turpis enim blandit mi, in porttitor pede justo eu massa. Donec dapibus. Duis at velit eu est congue elementum. In hac habitasse platea dictumst. Morbi vestibulum, velit id pretium iaculis, diam erat fermentum justo, nec condimentum neque sapien placerat ante. Nulla justo. Aliquam quis turpis eget elit sodales scelerisque. Mauris sit amet eros.",
    "approvalStatus": false,
    "numberOfVacancies": 12,
    "interviewsAreScheduled": 12
  },
  {
    "id": 13,
    "name": "Centimia",
    "companyLogo": "http://dummyimage.com/157x100.png/dddddd/000000",
    "url": "https://pbs.org/ligula/suspendisse/ornare/consequat/lectus.png?augue=vestibulum&vestibulum=ante&ante=ipsum&ipsum=primis&primis=in&in=faucibus&faucibus=orci&orci=luctus&luctus=et&et=ultrices&ultrices=posuere&posuere=cubilia&cubilia=curae&curae=duis&donec=faucibus&pharetra=accumsan&magna=odio&vestibulum=curabitur&aliquet=convallis&ultrices=duis&erat=consequat&tortor=dui&sollicitudin=nec&mi=nisi&sit=volutpat&amet=eleifend&lobortis=donec&sapien=ut&sapien=dolor&non=morbi&mi=vel&integer=lectus&ac=in&neque=quam&duis=fringilla&bibendum=rhoncus&morbi=mauris&non=enim&quam=leo&nec=rhoncus&dui=sed&luctus=vestibulum&rutrum=sit&nulla=amet&tellus=cursus&in=id&sagittis=turpis&dui=integer&vel=aliquet&nisl=massa&duis=id&ac=lobortis&nibh=convallis&fusce=tortor&lacus=risus&purus=dapibus&aliquet=augue&at=vel&feugiat=accumsan&non=tellus&pretium=nisi&quis=eu&lectus=orci&suspendisse=mauris&potenti=lacinia&in=sapien&eleifend=quis&quam=libero&a=nullam&odio=sit&in=amet&hac=turpis&habitasse=elementum&platea=ligula&dictumst=vehicula&maecenas=consequat&ut=morbi&massa=a&quis=ipsum&augue=integer&luctus=a&tincidunt=nibh&nulla=in&mollis=quis&molestie=justo&lorem=maecenas&quisque=rhoncus&ut=aliquam&erat=lacus&curabitur=morbi&gravida=quis&nisi=tortor&at=id",
    "location": "2 Kinsman Road",
    "domainAddress": "buzzfeed.com",
    "details": "Ut tellus. Nulla ut erat id mauris vulputate elementum. Nullam varius. Nulla facilisi.",
    "description": "Vivamus vel nulla eget eros elementum pellentesque. Quisque porta volutpat erat. Quisque erat eros, viverra eget, congue eget, semper rutrum, nulla. Nunc purus. Phasellus in felis. Donec semper sapien a libero.",
    "approvalStatus": true,
    "numberOfVacancies": 13,
    "interviewsAreScheduled": 13
  },
  {
    "id": 14,
    "name": "Mydeo",
    "companyLogo": "http://dummyimage.com/205x100.png/dddddd/000000",
    "url": "https://cisco.com/nec/euismod/scelerisque/quam/turpis.jpg?erat=suspendisse&id=potenti&mauris=in&vulputate=eleifend&elementum=quam&nullam=a&varius=odio&nulla=in&facilisi=hac&cras=habitasse&non=platea&velit=dictumst&nec=maecenas&nisi=ut&vulputate=massa&nonummy=quis&maecenas=augue&tincidunt=luctus&lacus=tincidunt&at=nulla&velit=mollis&vivamus=molestie&vel=lorem&nulla=quisque&eget=ut&eros=erat&elementum=curabitur&pellentesque=gravida&quisque=nisi&porta=at&volutpat=nibh&erat=in&quisque=hac&erat=habitasse&eros=platea&viverra=dictumst&eget=aliquam&congue=augue&eget=quam&semper=sollicitudin&rutrum=vitae&nulla=consectetuer&nunc=eget&purus=rutrum&phasellus=at&in=lorem&felis=integer&donec=tincidunt&semper=ante&sapien=vel&a=ipsum&libero=praesent&nam=blandit&dui=lacinia&proin=erat&leo=vestibulum&odio=sed&porttitor=magna&id=at&consequat=nunc&in=commodo&consequat=placerat&ut=praesent&nulla=blandit&sed=nam&accumsan=nulla&felis=integer&ut=pede&at=justo&dolor=lacinia&quis=eget&odio=tincidunt&consequat=eget&varius=tempus&integer=vel&ac=pede&leo=morbi&pellentesque=porttitor&ultrices=lorem&mattis=id&odio=ligula&donec=suspendisse&vitae=ornare&nisi=consequat&nam=lectus&ultrices=in&libero=est&non=risus&mattis=auctor&pulvinar=sed&nulla=tristique",
    "location": "5 Luster Pass",
    "domainAddress": "naver.com",
    "details": "Vestibulum ante ipsum primis in faucibus orci luctus et ultrices posuere cubilia Curae; Nulla dapibus dolor vel est.",
    "description": "Morbi vestibulum, velit id pretium iaculis, diam erat fermentum justo, nec condimentum neque sapien placerat ante. Nulla justo. Aliquam quis turpis eget elit sodales scelerisque. Mauris sit amet eros. Suspendisse accumsan tortor quis turpis.",
    "approvalStatus": false,
    "numberOfVacancies": 14,
    "interviewsAreScheduled": 14
  },
  {
    "id": 15,
    "name": "Skidoo",
    "companyLogo": "http://dummyimage.com/216x100.png/ff4444/ffffff",
    "url": "http://gnu.org/pede/ac/diam/cras/pellentesque/volutpat/dui.json?erat=sem&fermentum=fusce&justo=consequat&nec=nulla&condimentum=nisl&neque=nunc&sapien=nisl&placerat=duis&ante=bibendum&nulla=felis&justo=sed&aliquam=interdum&quis=venenatis&turpis=turpis&eget=enim&elit=blandit&sodales=mi&scelerisque=in&mauris=porttitor&sit=pede&amet=justo&eros=eu&suspendisse=massa&accumsan=donec&tortor=dapibus&quis=duis&turpis=at&sed=velit&ante=eu&vivamus=est&tortor=congue&duis=elementum&mattis=in&egestas=hac&metus=habitasse&aenean=platea&fermentum=dictumst&donec=morbi&ut=vestibulum&mauris=velit&eget=id&massa=pretium&tempor=iaculis&convallis=diam&nulla=erat&neque=fermentum&libero=justo&convallis=nec&eget=condimentum&eleifend=neque&luctus=sapien&ultricies=placerat&eu=ante&nibh=nulla&quisque=justo&id=aliquam&justo=quis&sit=turpis&amet=eget&sapien=elit&dignissim=sodales&vestibulum=scelerisque&vestibulum=mauris&ante=sit&ipsum=amet&primis=eros&in=suspendisse&faucibus=accumsan&orci=tortor&luctus=quis&et=turpis&ultrices=sed&posuere=ante&cubilia=vivamus&curae=tortor&nulla=duis&dapibus=mattis&dolor=egestas&vel=metus&est=aenean&donec=fermentum&odio=donec&justo=ut&sollicitudin=mauris&ut=eget&suscipit=massa&a=tempor&feugiat=convallis&et=nulla&eros=neque&vestibulum=libero&ac=convallis&est=eget&lacinia=eleifend&nisi=luctus",
    "location": "2 Fremont Court",
    "domainAddress": "posterous.com",
    "details": "Integer aliquet, massa id lobortis convallis, tortor risus dapibus augue, vel accumsan tellus nisi eu orci. Mauris lacinia sapien quis libero. Nullam sit amet turpis elementum ligula vehicula consequat. Morbi a ipsum.",
    "description": "Lorem ipsum dolor sit amet, consectetuer adipiscing elit. Proin interdum mauris non ligula pellentesque ultrices. Phasellus id sapien in sapien iaculis congue. Vivamus metus arcu, adipiscing molestie, hendrerit at, vulputate vitae, nisl.",
    "approvalStatus": true,
    "numberOfVacancies": 15,
    "interviewsAreScheduled": 15
  },
  {
    "id": 16,
    "name": "Zooveo",
    "companyLogo": "http://dummyimage.com/225x100.png/dddddd/000000",
    "url": "https://naver.com/lacus/purus/aliquet/at/feugiat/non.json?fusce=convallis&posuere=eget&felis=eleifend&sed=luctus&lacus=ultricies&morbi=eu&sem=nibh&mauris=quisque&laoreet=id&ut=justo&rhoncus=sit&aliquet=amet&pulvinar=sapien&sed=dignissim&nisl=vestibulum&nunc=vestibulum&rhoncus=ante&dui=ipsum&vel=primis&sem=in&sed=faucibus&sagittis=orci&nam=luctus&congue=et&risus=ultrices&semper=posuere&porta=cubilia",
    "location": "9099 Doe Crossing Avenue",
    "domainAddress": "tripadvisor.com",
    "details": "Proin eu mi. Nulla ac enim.",
    "description": "Vivamus in felis eu sapien cursus vestibulum. Proin eu mi. Nulla ac enim. In tempor, turpis nec euismod scelerisque, quam turpis adipiscing lorem, vitae mattis nibh ligula nec sem.",
    "approvalStatus": false,
    "numberOfVacancies": 16,
    "interviewsAreScheduled": 16
  },
  {
    "id": 17,
    "name": "Feedmix",
    "companyLogo": "http://dummyimage.com/158x100.png/5fa2dd/ffffff",
    "url": "http://hhs.gov/ultrices/posuere/cubilia/curae/mauris/viverra.jsp?nullam=habitasse&sit=platea&amet=dictumst&turpis=etiam&elementum=faucibus&ligula=cursus&vehicula=urna",
    "location": "760 Ronald Regan Court",
    "domainAddress": "yelp.com",
    "details": "Cras in purus eu magna vulputate luctus. Cum sociis natoque penatibus et magnis dis parturient montes, nascetur ridiculus mus.",
    "description": "Vestibulum ante ipsum primis in faucibus orci luctus et ultrices posuere cubilia Curae; Duis faucibus accumsan odio. Curabitur convallis. Duis consequat dui nec nisi volutpat eleifend. Donec ut dolor. Morbi vel lectus in quam fringilla rhoncus. Mauris enim leo, rhoncus sed, vestibulum sit amet, cursus id, turpis. Integer aliquet, massa id lobortis convallis, tortor risus dapibus augue, vel accumsan tellus nisi eu orci.",
    "approvalStatus": false,
    "numberOfVacancies": 17,
    "interviewsAreScheduled": 17
  },
  {
    "id": 18,
    "name": "Gigashots",
    "companyLogo": "http://dummyimage.com/153x100.png/dddddd/000000",
    "url": "https://soundcloud.com/justo/maecenas.png?non=auctor&velit=sed&nec=tristique&nisi=in&vulputate=tempus&nonummy=sit&maecenas=amet&tincidunt=sem&lacus=fusce&at=consequat&velit=nulla&vivamus=nisl&vel=nunc&nulla=nisl&eget=duis&eros=bibendum&elementum=felis&pellentesque=sed&quisque=interdum&porta=venenatis&volutpat=turpis&erat=enim&quisque=blandit&erat=mi&eros=in&viverra=porttitor&eget=pede&congue=justo&eget=eu",
    "location": "98 Northland Road",
    "domainAddress": "examiner.com",
    "details": "Donec diam neque, vestibulum eget, vulputate ut, ultrices vel, augue. Vestibulum ante ipsum primis in faucibus orci luctus et ultrices posuere cubilia Curae; Donec pharetra, magna vestibulum aliquet ultrices, erat tortor sollicitudin mi, sit amet lobortis sapien sapien non mi. Integer ac neque. Duis bibendum. Morbi non quam nec dui luctus rutrum. Nulla tellus.",
    "description": "Aenean auctor gravida sem. Praesent id massa id nisl venenatis lacinia. Aenean sit amet justo.",
    "approvalStatus": true,
    "numberOfVacancies": 18,
    "interviewsAreScheduled": 18
  },
  {
    "id": 19,
    "name": "Yodel",
    "companyLogo": "http://dummyimage.com/161x100.png/cc0000/ffffff",
    "url": "https://va.gov/enim/lorem/ipsum/dolor/sit/amet.html?rutrum=quam&at=pede&lorem=lobortis&integer=ligula&tincidunt=sit&ante=amet&vel=eleifend&ipsum=pede&praesent=libero&blandit=quis&lacinia=orci&erat=nullam&vestibulum=molestie",
    "location": "641 Magdeline Hill",
    "domainAddress": "delicious.com",
    "details": "Donec dapibus. Duis at velit eu est congue elementum. In hac habitasse platea dictumst. Morbi vestibulum, velit id pretium iaculis, diam erat fermentum justo, nec condimentum neque sapien placerat ante. Nulla justo. Aliquam quis turpis eget elit sodales scelerisque. Mauris sit amet eros. Suspendisse accumsan tortor quis turpis.",
    "description": "Morbi a ipsum. Integer a nibh.",
    "approvalStatus": false,
    "numberOfVacancies": 19,
    "interviewsAreScheduled": 19
  },
  {
    "id": 20,
    "name": "Feedfire",
    "companyLogo": "http://dummyimage.com/225x100.png/cc0000/ffffff",
    "url": "http://123-reg.co.uk/libero/ut/massa/volutpat.json?pede=pede&justo=ac&lacinia=diam&eget=cras&tincidunt=pellentesque&eget=volutpat&tempus=dui&vel=maecenas&pede=tristique&morbi=est&porttitor=et&lorem=tempus&id=semper&ligula=est&suspendisse=quam&ornare=pharetra&consequat=magna&lectus=ac&in=consequat&est=metus&risus=sapien&auctor=ut&sed=nunc&tristique=vestibulum&in=ante&tempus=ipsum&sit=primis&amet=in&sem=faucibus&fusce=orci&consequat=luctus&nulla=et&nisl=ultrices&nunc=posuere&nisl=cubilia&duis=curae&bibendum=mauris&felis=viverra&sed=diam&interdum=vitae&venenatis=quam&turpis=suspendisse&enim=potenti&blandit=nullam&mi=porttitor&in=lacus&porttitor=at&pede=turpis&justo=donec&eu=posuere&massa=metus&donec=vitae&dapibus=ipsum&duis=aliquam&at=non&velit=mauris&eu=morbi&est=non&congue=lectus&elementum=aliquam&in=sit&hac=amet&habitasse=diam&platea=in&dictumst=magna&morbi=bibendum&vestibulum=imperdiet&velit=nullam&id=orci&pretium=pede&iaculis=venenatis&diam=non&erat=sodales&fermentum=sed&justo=tincidunt&nec=eu&condimentum=felis&neque=fusce&sapien=posuere&placerat=felis&ante=sed&nulla=lacus&justo=morbi&aliquam=sem&quis=mauris",
    "location": "3252 Mosinee Center",
    "domainAddress": "jigsy.com",
    "details": "Aenean lectus. Pellentesque eget nunc.",
    "description": "Nulla ac enim. In tempor, turpis nec euismod scelerisque, quam turpis adipiscing lorem, vitae mattis nibh ligula nec sem. Duis aliquam convallis nunc. Proin at turpis a pede posuere nonummy. Integer non velit. Donec diam neque, vestibulum eget, vulputate ut, ultrices vel, augue.",
    "approvalStatus": false,
    "numberOfVacancies": 20,
    "interviewsAreScheduled": 20
  }
]
