<svg width="24" height="19" viewBox="0 0 24 19" fill="none" xmlns="http://www.w3.org/2000/svg">
<path d="M20.0818 3.02124H11.5109L9.91041 0H0V16.1618C0 17.1766 0.823478 18 1.8383 18C2.85311 18 3.67652 17.1766 3.67652 16.1618V5.00458H20.0818V3.02124Z" fill="#A989F5"/>
<path d="M1.83252 17.884H19.1308C21.375 17.884 23.1901 16.069 23.1901 13.8248V5.00458H3.67075V14.3756" stroke="#171321" stroke-width="1.1595" stroke-miterlimit="10"/>
</svg>
