<svg width="32" height="33" viewBox="0 0 32 33" fill="none" xmlns="http://www.w3.org/2000/svg">
<g clip-path="url(#clip0_748_5917)">
<path d="M1.71657 23.0314C1.58839 23.0315 1.46313 22.9931 1.35701 22.9212C1.25089 22.8494 1.1688 22.7473 1.12137 22.6282C-0.0317241 19.7246 -0.309562 16.547 0.322139 13.4874C0.953841 10.4279 2.46744 7.62013 4.67619 5.4107C6.88494 3.20127 9.6922 1.6868 12.7516 1.05415C15.811 0.421511 18.9887 0.69837 21.8926 1.85057C22.0352 1.92125 22.1464 2.04255 22.2044 2.19078C22.2624 2.33902 22.2631 2.50355 22.2063 2.65227C22.1496 2.80099 22.0394 2.92321 21.8974 2.99508C21.7553 3.06695 21.5916 3.08332 21.4382 3.04097C18.7641 1.97303 15.8356 1.71281 13.0151 2.29253C10.1947 2.87225 7.60616 4.26644 5.5701 6.3025C3.53404 8.33856 2.13985 10.9271 1.56013 13.7475C0.980413 16.568 1.24063 19.4965 2.30857 22.1706C2.33975 22.2487 2.35521 22.3323 2.35406 22.4164C2.35292 22.5005 2.33519 22.5836 2.30191 22.6609C2.26862 22.7382 2.22042 22.8081 2.16006 22.8668C2.09971 22.9254 2.02838 22.9715 1.95017 23.0026C1.87461 23.0258 1.79553 23.0356 1.71657 23.0314Z" fill="#171321"/>
<path d="M16.0018 32.7338C13.5742 32.7438 11.1766 32.1964 8.99381 31.1338C8.84105 31.0595 8.72404 30.9276 8.66853 30.7671C8.61302 30.6066 8.62355 30.4306 8.69781 30.2778C8.77207 30.125 8.90398 30.008 9.06451 29.9525C9.22504 29.897 9.40105 29.9075 9.55381 29.9818C11.5617 30.9607 13.768 31.4644 16.0018 31.4538C18.4579 31.4545 20.875 30.8406 23.0331 29.6681C25.1912 28.4956 27.0217 26.8017 28.3576 24.7408C29.6936 22.6799 30.4927 20.3175 30.6821 17.8687C30.8714 15.42 30.4451 12.9628 29.4418 10.721C29.3722 10.5661 29.367 10.3899 29.4273 10.2312C29.4876 10.0725 29.6085 9.94419 29.7634 9.8746C29.9183 9.80501 30.0945 9.79979 30.2532 9.86011C30.412 9.92042 30.5402 10.0413 30.6098 10.1962C31.7007 12.633 32.1645 15.304 31.9589 17.9659C31.7533 20.6278 30.8849 23.1959 29.4328 25.4363C27.9806 27.6766 25.991 29.518 23.6451 30.7926C21.2992 32.0672 18.6716 32.7346 16.0018 32.7338Z" fill="#171321"/>
<path d="M5.43999 17.3702C5.27025 17.3702 5.10746 17.3028 4.98744 17.1828C4.86742 17.0627 4.79999 16.9 4.79999 16.7302C4.80424 14.5188 5.46307 12.3581 6.69343 10.5205C7.92379 8.68294 9.67061 7.25073 11.7137 6.4044C13.7568 5.55808 16.0047 5.33553 18.1741 5.7648C20.3434 6.19408 22.3372 7.25597 23.904 8.81662C24.2944 9.21003 24.6569 9.63026 24.9888 10.0742C25.0902 10.2104 25.1334 10.3814 25.1087 10.5494C25.0841 10.7174 24.9938 10.8688 24.8576 10.9702C24.7214 11.0716 24.5504 11.1148 24.3824 11.0902C24.2144 11.0656 24.063 10.9752 23.9616 10.839C23.1131 9.69514 22.0282 8.74738 20.7808 8.06017C19.5333 7.37296 18.1525 6.96242 16.7322 6.85646C15.312 6.7505 13.8855 6.95161 12.5499 7.44611C11.2143 7.94061 10.0008 8.71691 8.99199 9.72222C8.06716 10.6396 7.33356 11.7315 6.83371 12.9344C6.33385 14.1374 6.07766 15.4275 6.07999 16.7302C6.07999 16.9 6.01256 17.0627 5.89254 17.1828C5.77251 17.3028 5.60973 17.3702 5.43999 17.3702Z" fill="#171321"/>
<path d="M16.0024 27.9294C14.532 27.9295 13.0759 27.6393 11.7179 27.0753C10.3599 26.5114 9.1266 25.6848 8.08884 24.643C7.69129 24.2427 7.32238 23.815 6.98484 23.363C6.92249 23.2975 6.87472 23.2195 6.84469 23.1342C6.81465 23.0489 6.80303 22.9582 6.81059 22.8681C6.81815 22.778 6.84472 22.6905 6.88855 22.6114C6.93238 22.5323 6.99247 22.4634 7.06487 22.4093C7.13726 22.3551 7.22032 22.3168 7.30856 22.2971C7.3968 22.2773 7.48823 22.2765 7.57681 22.2947C7.6654 22.3128 7.74913 22.3495 7.8225 22.4024C7.89586 22.4553 7.95719 22.5231 8.00244 22.6014C8.30491 23.0038 8.63646 23.3834 8.99444 23.7374C10.3817 25.1221 12.1481 26.0648 14.0707 26.4465C15.9933 26.8282 17.9859 26.6317 19.7969 25.882C21.608 25.1322 23.1563 23.8628 24.2465 22.2338C25.3367 20.6049 25.9199 18.6895 25.9224 16.7294C25.9224 16.5596 25.9899 16.3968 26.1099 16.2768C26.2299 16.1568 26.3927 16.0894 26.5624 16.0894C26.7322 16.0894 26.895 16.1568 27.015 16.2768C27.135 16.3968 27.2024 16.5596 27.2024 16.7294C27.2054 18.201 26.9177 19.6587 26.3559 21.0189C25.7941 22.3791 24.9692 23.6149 23.9286 24.6555C22.888 25.6961 21.6522 26.521 20.292 27.0828C18.9318 27.6446 17.4741 27.9323 16.0024 27.9294Z" fill="#171321"/>
<path d="M24.4829 11.0945H21.6733C21.5036 11.0945 21.3408 11.0271 21.2208 10.9071C21.1008 10.787 21.0333 10.6242 21.0333 10.4545C21.0333 10.2848 21.1008 10.122 21.2208 10.002C21.3408 9.88194 21.5036 9.81451 21.6733 9.81451H23.8429V7.64171C23.8429 7.47197 23.9104 7.30918 24.0304 7.18916C24.1504 7.06914 24.3132 7.00171 24.4829 7.00171C24.6527 7.00171 24.8155 7.06914 24.9355 7.18916C25.0555 7.30918 25.1229 7.47197 25.1229 7.64171V10.4545C25.1229 10.6242 25.0555 10.787 24.9355 10.9071C24.8155 11.0271 24.6527 11.0945 24.4829 11.0945Z" fill="#171321"/>
<path d="M7.49834 26.4239C7.3286 26.4239 7.16581 26.3564 7.04579 26.2364C6.92577 26.1164 6.85834 25.9536 6.85834 25.7839V22.9711C6.85834 22.8013 6.92577 22.6385 7.04579 22.5185C7.16581 22.3985 7.3286 22.3311 7.49834 22.3311H10.3111C10.4809 22.3311 10.6437 22.3985 10.7637 22.5185C10.8837 22.6385 10.9511 22.8013 10.9511 22.9711C10.9511 23.1408 10.8837 23.3036 10.7637 23.4236C10.6437 23.5436 10.4809 23.6111 10.3111 23.6111H8.13834V25.7839C8.13834 25.9536 8.07091 26.1164 7.95089 26.2364C7.83086 26.3564 7.66808 26.4239 7.49834 26.4239Z" fill="#171321"/>
<mask id="path-7-inside-1_748_5917" fill="white">
<path d="M16.0001 21.9119C15.8652 21.9107 15.7342 21.8671 15.6257 21.7871L11.0689 18.4815C10.8986 18.3579 10.7719 18.1835 10.707 17.9835C10.642 17.7834 10.6421 17.5679 10.7073 17.3679L12.2753 12.5391C12.3288 12.3742 12.4332 12.2305 12.5735 12.1288C12.7138 12.027 12.8827 11.9723 13.0561 11.9727C13.2283 11.9737 13.3958 12.0289 13.5349 12.1306C13.6739 12.2323 13.7773 12.3752 13.8305 12.5391L14.7201 15.3039H17.2801L18.1793 12.5391C18.2334 12.3756 18.3377 12.2334 18.4773 12.1326C18.6169 12.0318 18.7847 11.9776 18.9569 11.9776C19.129 11.9776 19.2968 12.0318 19.4364 12.1326C19.576 12.2334 19.6803 12.3756 19.7345 12.5391L21.2929 17.3679C21.3588 17.5683 21.3593 17.7845 21.2943 17.9853C21.2293 18.186 21.1021 18.3609 20.9313 18.4847L16.3777 21.7871C16.2682 21.8677 16.136 21.9114 16.0001 21.9119ZM11.9873 17.5663L16.0001 20.4783L20.0129 17.5663L18.9473 14.2799L18.3425 16.1391C18.3006 16.2674 18.2193 16.3792 18.1101 16.4585C18.0009 16.5378 17.8694 16.5806 17.7345 16.5807H14.2689C14.1339 16.5806 14.0024 16.5378 13.8932 16.4585C13.784 16.3792 13.7027 16.2674 13.6609 16.1391L13.0561 14.2767L11.9873 17.5663Z"/>
</mask>
<path d="M15.6257 21.7871L16.8123 20.1771L16.8062 20.1726L16.8 20.1682L15.6257 21.7871ZM11.0689 18.4815L9.89391 20.0999L9.89448 20.1004L11.0689 18.4815ZM10.7073 17.3679L12.6089 17.9873L12.6095 17.9855L10.7073 17.3679ZM12.2753 12.5391L14.1775 13.1567L14.1777 13.1562L12.2753 12.5391ZM13.8305 12.5391L15.7343 11.9265L15.7329 11.9219L13.8305 12.5391ZM14.7201 15.3039L12.8162 15.9164L13.2626 17.3039H14.7201V15.3039ZM17.2801 15.3039V17.3039H18.7327L19.182 15.9224L17.2801 15.3039ZM18.1793 12.5391L16.2808 11.9098L16.2773 11.9205L18.1793 12.5391ZM18.9569 11.9776V9.97759V11.9776ZM19.7345 12.5391L21.6378 11.9248L21.6354 11.9173L21.6329 11.9098L19.7345 12.5391ZM21.2929 17.3679L19.3895 17.9821L19.3929 17.9925L21.2929 17.3679ZM20.9313 18.4847L19.758 16.865L19.7571 16.8656L20.9313 18.4847ZM16.3777 21.7871L15.2035 20.168L15.1973 20.1725L15.1911 20.1771L16.3777 21.7871ZM11.9873 17.5663L10.0851 16.9483L9.63588 18.331L10.8126 19.185L11.9873 17.5663ZM16.0001 20.4783L14.8254 22.097L16.0001 22.9494L17.1747 22.097L16.0001 20.4783ZM20.0129 17.5663L21.1875 19.185L22.3635 18.3316L21.9154 16.9494L20.0129 17.5663ZM18.9473 14.2799L20.8498 13.663L18.9504 7.80508L17.0454 13.6612L18.9473 14.2799ZM18.3425 16.1391L20.2439 16.7591L20.2444 16.7577L18.3425 16.1391ZM17.7345 16.5807V18.5807L17.7359 18.5807L17.7345 16.5807ZM14.2689 16.5807L14.2674 18.5807H14.2689V16.5807ZM13.6609 16.1391L11.7587 16.7568L11.7594 16.7591L13.6609 16.1391ZM13.0561 14.2767L14.9583 13.6589L13.0565 7.80277L11.1539 13.6587L13.0561 14.2767ZM16.0167 19.9119C16.3032 19.9143 16.5817 20.0071 16.8123 20.1771L14.439 23.397C14.8867 23.727 15.4272 23.9072 15.9834 23.9118L16.0167 19.9119ZM16.8 20.1682L12.2432 16.8626L9.89448 20.1004L14.4513 23.406L16.8 20.1682ZM12.2438 16.863C12.4157 16.9878 12.5436 17.1638 12.6092 17.3658L8.80475 18.6011C9.00027 19.2033 9.38158 19.728 9.89391 20.0999L12.2438 16.863ZM12.6092 17.3658C12.6748 17.5678 12.6747 17.7854 12.6089 17.9873L8.80562 16.7484C8.60953 17.3504 8.60922 17.999 8.80475 18.6011L12.6092 17.3658ZM12.6095 17.9855L14.1775 13.1567L10.373 11.9214L8.80504 16.7502L12.6095 17.9855ZM14.1777 13.1562C14.1006 13.3939 13.9501 13.601 13.7478 13.7477L11.3991 10.5098C10.9163 10.8601 10.557 11.3545 10.3729 11.9219L14.1777 13.1562ZM13.7478 13.7477C13.5456 13.8944 13.302 13.9731 13.0522 13.9727L13.0599 9.97266C12.4634 9.97151 11.8819 10.1596 11.3991 10.5098L13.7478 13.7477ZM13.0443 13.9726C12.796 13.9712 12.5545 13.8915 12.3542 13.7449L14.7156 10.5163C14.2371 10.1664 13.6606 9.97618 13.0678 9.97269L13.0443 13.9726ZM12.3542 13.7449C12.1538 13.5984 12.0047 13.3924 11.9281 13.1562L15.7329 11.9219C15.55 11.3581 15.194 10.8663 14.7156 10.5163L12.3542 13.7449ZM11.9266 13.1516L12.8162 15.9164L16.6239 14.6913L15.7343 11.9265L11.9266 13.1516ZM14.7201 17.3039H17.2801V13.3039H14.7201V17.3039ZM19.182 15.9224L20.0812 13.1576L16.2773 11.9205L15.3781 14.6853L19.182 15.9224ZM20.0777 13.1683C19.9996 13.4039 19.8493 13.6088 19.6481 13.7541L17.3065 10.5111C16.8261 10.858 16.4672 11.3474 16.2808 11.9098L20.0777 13.1683ZM19.6481 13.7541C19.4469 13.8994 19.205 13.9776 18.9569 13.9776V9.97759C18.3643 9.97759 17.7869 10.1643 17.3065 10.5111L19.6481 13.7541ZM18.9569 13.9776C18.7087 13.9776 18.4668 13.8994 18.2656 13.7541L20.6072 10.5111C20.1268 10.1643 19.5494 9.97759 18.9569 9.97759V13.9776ZM18.2656 13.7541C18.0644 13.6088 17.9141 13.4039 17.836 13.1683L21.6329 11.9098C21.4465 11.3474 21.0876 10.858 20.6072 10.5111L18.2656 13.7541ZM17.8311 13.1533L19.3895 17.9821L23.1962 16.7536L21.6378 11.9248L17.8311 13.1533ZM19.3929 17.9925C19.3264 17.7901 19.3259 17.5719 19.3915 17.3692L23.197 18.6013C23.3926 17.9972 23.3912 17.3465 23.1928 16.7432L19.3929 17.9925ZM19.3915 17.3692C19.4571 17.1665 19.5855 16.9899 19.758 16.865L22.1045 20.1044C22.6188 19.7318 23.0014 19.2055 23.197 18.6013L19.3915 17.3692ZM19.7571 16.8656L15.2035 20.168L17.5518 23.4061L22.1054 20.1037L19.7571 16.8656ZM15.1911 20.1771C15.4236 20.0057 15.7047 19.9128 15.9935 19.9119L16.0066 23.9119C16.5673 23.91 17.1129 23.7297 17.5642 23.3971L15.1911 20.1771ZM10.8126 19.185L14.8254 22.097L17.1747 18.8596L13.1619 15.9476L10.8126 19.185ZM17.1747 22.097L21.1875 19.185L18.8382 15.9476L14.8254 18.8596L17.1747 22.097ZM21.9154 16.9494L20.8498 13.663L17.0448 14.8967L18.1104 18.1831L21.9154 16.9494ZM17.0454 13.6612L16.4406 15.5204L20.2444 16.7577L20.8492 14.8985L17.0454 13.6612ZM16.441 15.5191C16.5299 15.2464 16.7027 15.0088 16.9348 14.8403L19.2854 18.0767C19.7359 17.7495 20.0714 17.2883 20.2439 16.7591L16.441 15.5191ZM16.9348 14.8403C17.1668 14.6717 17.4462 14.5809 17.733 14.5807L17.7359 18.5807C18.2926 18.5803 18.835 18.4039 19.2854 18.0767L16.9348 14.8403ZM17.7345 14.5807H14.2689V18.5807H17.7345V14.5807ZM14.2703 14.5807C14.5571 14.5809 14.8365 14.6717 15.0686 14.8403L12.7179 18.0767C13.1683 18.4039 13.7107 18.5803 14.2674 18.5807L14.2703 14.5807ZM15.0686 14.8403C15.3006 15.0088 15.4734 15.2464 15.5623 15.5191L11.7594 16.7591C11.932 17.2883 12.2675 17.7495 12.7179 18.0767L15.0686 14.8403ZM15.5631 15.5213L14.9583 13.6589L11.1539 14.8944L11.7587 16.7568L15.5631 15.5213ZM11.1539 13.6587L10.0851 16.9483L13.8894 18.1843L14.9582 14.8947L11.1539 13.6587Z" fill="#171321" mask="url(#path-7-inside-1_748_5917)"/>
</g>
<defs>
<clipPath id="clip0_748_5917">
<rect width="32" height="32" fill="white" transform="translate(0 0.730957)"/>
</clipPath>
</defs>
</svg>
