<svg width="24" height="24" viewBox="0 0 24 24" fill="none" xmlns="http://www.w3.org/2000/svg">
<path d="M2.5 6.99V11.49C2.5 14.84 3.94 18.33 6.5 20.49C7.85 21.63 9.58 22.51 12 23.36C14.42 22.51 16.15 21.63 17.5 20.49C20.06 18.33 21.5 14.84 21.5 11.49V4.49C14.99 4.6 12 0.809998 12 0.809998C12 0.809998 9.01 4.6 2.5 4.49H2" stroke="#171321" stroke-miterlimit="10"/>
<path d="M8.41 12.4L10.56 14.56L15.83 9.29001" stroke="#171321" stroke-miterlimit="10"/>
</svg>
