<svg width="24" height="27" viewBox="0 0 24 27" fill="none" xmlns="http://www.w3.org/2000/svg">
<path d="M11.704 18.6799H4.78596C2.69196 18.6799 1 16.982 1 14.894V8.75598L11.704 8.56995" fill="white"/>
<path d="M19.822 25.25L11.704 18.686V8.56997L19.822 2V25.25Z" fill="white"/>
<path d="M20.302 18.368C24.604 16.376 24.61 11.132 20.302 9.14001V18.368Z" fill="#A989F5"/>
<path d="M8.50603 18.686L11.704 26H6.35198L3.11804 18.6021" fill="#7759C2"/>
<path d="M11.704 18.6799H4.78596C2.69196 18.6799 1 16.982 1 14.894V8.75598L11.704 8.56995" stroke="#171321" stroke-width="1.2" stroke-miterlimit="10"/>
<path d="M19.822 25.25L11.704 18.686V8.56997L19.822 2V25.25Z" stroke="#171321" stroke-width="1.2" stroke-miterlimit="10"/>
</svg>
