<svg width="32" height="32" viewBox="0 0 32 32" fill="none" xmlns="http://www.w3.org/2000/svg">
<g clip-path="url(#clip0_3386_1780)">
<path d="M28.2295 23.3739H18.3234C18.1764 22.8715 17.8706 22.4303 17.4517 22.1164C17.0328 21.8025 16.5234 21.6328 16 21.6328C15.4765 21.6328 14.9671 21.8025 14.5482 22.1164C14.1293 22.4303 13.8235 22.8715 13.6765 23.3739H3.77039V24.7652H13.6765C13.8235 25.2676 14.1293 25.7089 14.5482 26.0228C14.9671 26.3367 15.4765 26.5064 16 26.5064C16.5234 26.5064 17.0328 26.3367 17.4517 26.0228C17.8706 25.7089 18.1764 25.2676 18.3234 24.7652H28.2295V23.3739ZM16 25.1131C15.7936 25.1131 15.5918 25.0519 15.4202 24.9372C15.2486 24.8225 15.1149 24.6596 15.0359 24.4689C14.9569 24.2782 14.9363 24.0684 14.9765 23.866C15.0168 23.6636 15.1162 23.4777 15.2621 23.3317C15.408 23.1858 15.594 23.0864 15.7964 23.0462C15.9988 23.0059 16.2086 23.0266 16.3993 23.1055C16.5899 23.1845 16.7529 23.3183 16.8676 23.4899C16.9822 23.6615 17.0434 23.8632 17.0434 24.0696C17.0434 24.3463 16.9335 24.6117 16.7378 24.8074C16.5421 25.0031 16.2767 25.1131 16 25.1131Z" fill="#E5E0FC"/>
<path d="M16.0557 24.4174C17.0162 24.4174 17.7948 23.6388 17.7948 22.6783C17.7948 21.7178 17.0162 20.9391 16.0557 20.9391C15.0952 20.9391 14.3165 21.7178 14.3165 22.6783C14.3165 23.6388 15.0952 24.4174 16.0557 24.4174Z" fill="#AC7FFF"/>
<path d="M25.0921 13.8574H27.8747V31.3044H3.77039V28.5218H23.0121C23.5656 28.5218 24.0964 28.3019 24.4878 27.9105C24.8792 27.5191 25.0991 26.9883 25.0991 26.4348L25.0921 13.8574Z" fill="#E5E0FC"/>
<path d="M31.3043 21.9826H18.3235C18.1765 21.4802 17.8706 21.039 17.4517 20.7251C17.0328 20.4112 16.5235 20.2415 16 20.2415C15.4765 20.2415 14.9672 20.4112 14.5483 20.7251C14.1294 21.039 13.8235 21.4802 13.6765 21.9826H4.46609V14.7478H27.5339V19.2C27.5339 19.3845 27.6072 19.5614 27.7377 19.6919C27.8681 19.8224 28.0451 19.8957 28.2296 19.8957C28.4141 19.8957 28.591 19.8224 28.7215 19.6919C28.8519 19.5614 28.9252 19.3845 28.9252 19.2V14.0522C28.9252 13.8677 28.8519 13.6907 28.7215 13.5603C28.591 13.4298 28.4141 13.3565 28.2296 13.3565H25.7391V9.73913C25.7391 7.15615 24.713 4.67897 22.8866 2.85253C21.0602 1.02608 18.583 0 16 0C13.417 0 10.9398 1.02608 9.11339 2.85253C7.28695 4.67897 6.26087 7.15615 6.26087 9.73913V13.3565H3.77043C3.58594 13.3565 3.40899 13.4298 3.27853 13.5603C3.14807 13.6907 3.07478 13.8677 3.07478 14.0522V21.9826H0.695652C0.511154 21.9826 0.334212 22.0559 0.203752 22.1864C0.0732917 22.3168 0 22.4938 0 22.6783C0 22.8628 0.0732917 23.0397 0.203752 23.1702C0.334212 23.3006 0.511154 23.3739 0.695652 23.3739H13.6765C13.8235 23.8763 14.1294 24.3176 14.5483 24.6315C14.9672 24.9454 15.4765 25.115 16 25.115C16.5235 25.115 17.0328 24.9454 17.4517 24.6315C17.8706 24.3176 18.1765 23.8763 18.3235 23.3739H27.5339V30.6087H4.46609V26.1565C4.46609 25.972 4.3928 25.7951 4.26234 25.6646C4.13188 25.5342 3.95493 25.4609 3.77043 25.4609C3.58594 25.4609 3.40899 25.5342 3.27853 25.6646C3.14807 25.7951 3.07478 25.972 3.07478 26.1565V31.3043C3.07478 31.4888 3.14807 31.6658 3.27853 31.7962C3.40899 31.9267 3.58594 32 3.77043 32H28.2296C28.4141 32 28.591 31.9267 28.7215 31.7962C28.8519 31.6658 28.9252 31.4888 28.9252 31.3043V23.3739H31.3043C31.4888 23.3739 31.6658 23.3006 31.7962 23.1702C31.9267 23.0397 32 22.8628 32 22.6783C32 22.4938 31.9267 22.3168 31.7962 22.1864C31.6658 22.0559 31.4888 21.9826 31.3043 21.9826ZM7.65217 9.73913C7.65217 7.52515 8.53168 5.40185 10.0972 3.83633C11.6627 2.2708 13.786 1.3913 16 1.3913C18.214 1.3913 20.3373 2.2708 21.9028 3.83633C23.4683 5.40185 24.3478 7.52515 24.3478 9.73913V13.3565H7.65217V9.73913ZM16 23.7217C15.7936 23.7217 15.5919 23.6605 15.4203 23.5459C15.2487 23.4312 15.1149 23.2683 15.036 23.0776C14.957 22.8869 14.9363 22.6771 14.9766 22.4747C15.0168 22.2723 15.1162 22.0863 15.2621 21.9404C15.4081 21.7945 15.594 21.6951 15.7964 21.6548C15.9988 21.6146 16.2087 21.6352 16.3993 21.7142C16.59 21.7932 16.753 21.9269 16.8676 22.0985C16.9823 22.2701 17.0435 22.4719 17.0435 22.6783C17.0435 22.955 16.9335 23.2204 16.7379 23.4161C16.5422 23.6118 16.2767 23.7217 16 23.7217Z" fill="#341472"/>
</g>
<defs>
<clipPath id="clip0_3386_1780">
<rect width="32" height="32" fill="white"/>
</clipPath>
</defs>
</svg>
