<svg width="32" height="33" viewBox="0 0 32 33" fill="none" xmlns="http://www.w3.org/2000/svg">
<g clip-path="url(#clip0_7608_15008)">
<path d="M14.9287 13.8211L10.7469 9.66172C10.2492 9.15011 9.61153 8.79694 8.91383 8.64656C8.21612 8.49617 7.48954 8.55528 6.82532 8.81646C6.1611 9.07763 5.58885 9.52924 5.18043 10.1146C4.77201 10.6999 4.54563 11.3928 4.52971 12.1064C4.51379 12.8199 4.70905 13.5223 5.09097 14.1252C5.47289 14.7281 6.02443 15.2048 6.67635 15.4953C7.32826 15.7859 8.05149 15.8773 8.7552 15.7582C9.45892 15.6391 10.1117 15.3147 10.6317 14.8258L11.5916 13.8659" stroke="#171321" stroke-width="1.27982" stroke-linecap="round" stroke-linejoin="round"/>
<path d="M17.5776 7.88595L18.4703 6.92609C19.337 6.0412 20.4091 5.38436 21.5911 5.01403C22.7731 4.6437 24.0284 4.57138 25.2451 4.80351C26.4618 5.03563 27.6022 5.565 28.5648 6.34448C29.5275 7.12397 30.2824 8.12938 30.7625 9.27121C31.2426 10.413 31.4329 11.6559 31.3165 12.889C31.2 14.1222 30.7805 15.3074 30.0952 16.3393C29.4099 17.3711 28.4801 18.2174 27.3886 18.803C26.2971 19.3885 25.0778 19.6951 23.8391 19.6954" stroke="#171321" stroke-width="1.27982" stroke-linecap="round" stroke-linejoin="round"/>
<path d="M20.3358 10.5256L21.2477 9.65534C21.7458 9.14309 22.3843 8.78963 23.0829 8.63943C23.7814 8.48923 24.5088 8.549 25.1735 8.81123C25.8381 9.07346 26.4104 9.52642 26.8182 10.1131C27.226 10.6998 27.4512 11.394 27.4654 12.1084C27.4796 12.8228 27.2822 13.5254 26.898 14.1278C26.5138 14.7303 25.96 15.2056 25.3063 15.494C24.6526 15.7825 23.9281 15.8711 23.2242 15.7488C22.5202 15.6265 21.8681 15.2986 21.35 14.8066L13.5272 6.92614C12.6606 6.03964 11.5882 5.38126 10.4055 5.00966C9.22285 4.63806 7.96661 4.56478 6.74874 4.79635C5.53088 5.02793 4.38921 5.55716 3.42545 6.3369C2.46169 7.11664 1.70577 8.12266 1.22505 9.26535C0.744326 10.408 0.553724 11.6519 0.670227 12.8861C0.78673 14.1203 1.20672 15.3065 1.89277 16.3391C2.57883 17.3716 3.50964 18.2184 4.60229 18.804C5.69493 19.3897 6.91547 19.6959 8.15515 19.6955" stroke="#171321" stroke-width="1.27982" stroke-linecap="round" stroke-linejoin="round"/>
<path d="M15.9976 29.2301C12.9452 28.299 10.3472 25.6338 10.3472 22.1591V17.267C11.3497 17.6377 12.4465 17.6678 13.4678 17.3526C14.4892 17.0374 15.3783 16.3945 15.9976 15.5233V15.5233C16.6169 16.3945 17.5059 17.0374 18.5273 17.3526C19.5486 17.6678 20.6454 17.6377 21.6479 17.267V22.1591C21.6479 25.6338 19.0499 28.299 15.9976 29.2301" stroke="#171321" stroke-width="1.27982" stroke-linecap="round" stroke-linejoin="round"/>
<path d="M17.2997 22.5549V21.5222C17.3018 21.3524 17.2702 21.1839 17.2067 21.0264C17.1432 20.8689 17.049 20.7256 16.9297 20.6048C16.8104 20.4839 16.6682 20.388 16.5116 20.3225C16.3549 20.2571 16.1867 20.2234 16.0169 20.2234V20.2234C15.8471 20.2234 15.679 20.2571 15.5223 20.3225C15.3656 20.388 15.2234 20.4839 15.1041 20.6048C14.9848 20.7256 14.8906 20.8689 14.8271 21.0264C14.7636 21.1839 14.732 21.3524 14.7341 21.5222V22.5549" stroke="#171321" stroke-width="1.27982" stroke-linecap="round" stroke-linejoin="round"/>
<path d="M17.7582 22.5494H14.2452V25.0271H17.7582V22.5494Z" stroke="#171321" stroke-width="1.27982" stroke-linecap="round" stroke-linejoin="round"/>
</g>
<defs>
<clipPath id="clip0_7608_15008">
<rect width="31.9954" height="31.9954" fill="white" transform="translate(0 0.949341)"/>
</clipPath>
</defs>
</svg>
