Task: main pid 14921 rule r1 addr 0xd3a284
0x00d3a284  6a 61 73 6f 6e 74 0a 00 00 00 66 72 69 64 61 79   jasont....friday
0x00d3a294  31 33 74 68 63 00 00 00 00 01 00 00 00 04 00 00   13thc...........
0x00d3a2a4  00 43 00 00 00 73 19 00 00 00 74 00 00 6a 01 00   .C...s....t..j..
0x00d3a2b4  64 01 00 64 02 00 64 03 00 83 01 01 7d 00 00 7c   d..d..d.....}..|
0x00d3a2c4  00 00 53 28 04 00 00 00 4e 73 9c 01 00 00 49 74   ..S(....Ns....It
0x00d3a2d4  27 73 20 48 61 6c 6c 6f 77 65 65 6e 20 61 6e 64   's.Halloween.and
0x00d3a2e4  20 4a 61 73 6f 6e 27 73 20 62 61 63 6b 21 0a 20   .Jason's.back!..
0x00d3a2f4  20 20 20 41 6c 6c 20 79 6f 75 72 20 64 6f 63 75   ...All.your.docu
0x00d3a304  6d 65 6e 74 73 20 68 61 76 65 20 62 65 65 6e 20   ments.have.been.
0x00d3a314  65 6e 63 72 79 70 74 65 64 2e 20 49 66 20 79 6f   encrypted..If.yo
0x00d3a324  75 20 77 61 6e 74 20 74 6f 0a 20 20 20 20 72 65   u.want.to.....re
0x00d3a334  63 6f 76 65 72 20 79 6f 75 72 20 66 69 6c 65 73   cover.your.files
0x00d3a344  2c 20 70 72 6f 63 65 65 64 20 77 69 74 68 20 74   ,.proceed.with.t
0x00d3a354  72 61 6e 73 66 65 72 72 69 6e 67 20 30 2e 35 20   ransferring.0.5.
0x00d3a364  42 69 74 43 6f 69 6e 20 74 6f 20 74 68 65 20 77   BitCoin.to.the.w
0x00d3a374  61 6c 6c 65 74 0a 20 20 20 20 61 64 64 72 65 73   allet.....addres
Task: main pid 14921 rule r1 addr 0xd3a3da
0x00d3a3da  6a 61 73 6f 6e 5f 68 61 6c 6c 6f 77 65 65 6e 40   jason_halloween@
0x00d3a3ea  70 72 6f 74 6f 6e 6d 61 69 6c 2e 63 6f 6d 2e 20   protonmail.com..
0x00d3a3fa  55 6e 6c 65 73 73 20 74 68 69 73 20 69 73 20 64   Unless.this.is.d
0x00d3a40a  6f 6e 65 0a 20 20 20 20 77 69 74 68 69 6e 20 74   one.....within.t
0x00d3a41a  68 65 20 6e 65 78 74 20 32 34 20 68 6f 75 72 73   he.next.24.hours
0x00d3a42a  2c 20 79 6f 75 27 6c 6c 20 6e 65 76 65 72 20 72   ,.you'll.never.r
0x00d3a43a  65 63 6f 76 65 72 20 79 6f 75 72 20 66 69 6c 65   ecover.your.file
0x00d3a44a  73 20 61 67 61 69 6e 2e 0a 20 20 20 20 54 68 65   s.again......The
0x00d3a45a  20 63 6c 6f 63 6b 20 69 73 20 74 69 63 6b 69 6e   .clock.is.tickin
0x00d3a46a  67 2e 2e 2e 74 05 00 00 00 74 69 74 6c 65 73 0d   g...t....titles.
0x00d3a47a  00 00 00 4a 61 73 6f 6e 27 73 20 62 61 63 6b 21   ...Jason's.back!
0x00d3a48a  28 02 00 00 00 74 07 00 00 00 65 61 73 79 67 75   (....t....easygu
0x00d3a49a  69 74 06 00 00 00 6d 73 67 62 6f 78 28 01 00 00   it....msgbox(...
0x00d3a4aa  00 74 09 00 00 00 70 6f 70 75 70 5f 6d 73 67 28   .t....popup_msg(
0x00d3a4ba  00 00 00 00 28 00 00 00 00 73 07 00 00 00 6d 61   ....(....s....ma
0x00d3a4ca  69 6e 2e 70 79 74 05 00 00 00 70 6f 70 75 70 16   in.pyt....popup.
Task: main pid 14921 rule r1 addr 0x107e4f4
0x0107e4f4  6a 61 73 6f 6e 40 6f 70 74 69 70 6c e0 e4 07 01   jason@optipl....
0x0107e504  00 00 00 00 01 ab 0c 00 00 00 00 00 00 00 00 00   ................
0x0107e514  00 00 00 00 f8 e4 07 01 00 00 00 00 00 00 00 00   ................
0x0107e524  00 00 00 00 00 00 00 00 00 00 00 00 10 e5 07 01   ................
0x0107e534  00 00 00 00 00 00 00 00 00 00 00 00 00 00 00 00   ................
0x0107e544  00 00 00 00 28 e5 07 01 00 00 00 00 00 00 00 00   ....(...........
0x0107e554  00 00 00 00 00 00 00 00 00 00 00 00 40 e5 07 01   ............@...
0x0107e564  00 00 00 00 00 00 00 00 00 00 00 00 a4 e1 f8 8e   ................
0x0107e574  39 2a a8 d5 58 e5 07 01 00 00 00 00 a8 10 f2 00   9*..X...........
0x0107e584  00 00 00 00 00 00 00 00 00 00 00 00 70 e5 07 01   ............p...
0x0107e594  00 00 00 00 00 00 00 00 00 00 00 00 c6 9c e1 44   ...............D
0x0107e5a4  45 55 e6 7a 88 e5 07 01 00 00 00 00 58 36 d0 00   EU.z........X6..
0x0107e5b4  00 00 00 00 00 00 00 00 00 00 00 00 a0 e5 07 01   ................
0x0107e5c4  00 00 00 00 00 00 00 00 00 00 00 00 00 00 00 00   ................
0x0107e5d4  00 00 00 00 b8 e5 07 01 00 00 00 00 00 00 00 00   ................
0x0107e5e4  00 00 00 00 00 00 00 00 00 00 00 00 d0 e5 07 01   ................
Task: main pid 14921 rule r1 addr 0x114088e
0x0114088e  6a 61 73 6f 6e 5f 68 61 6c 6c 6f 77 65 65 6e 40   jason_halloween@
0x0114089e  70 72 6f 74 6f 6e 6d 61 69 6c 2e 63 6f 6d 2e 20   protonmail.com..
0x011408ae  55 6e 6c 65 73 73 20 74 68 69 73 20 69 73 20 64   Unless.this.is.d
0x011408be  6f 6e 65 0a 00 00 00 00 00 00 00 00 00 00 00 00   one.............
0x011408ce  00 00 ef 02 14 ef 00 00 00 00 70 00 00 00 00 00   ..........p.....
0x011408de  00 00 28 49 09 00 02 00 00 00 01 00 01 00 61 73   ..(I..........as
0x011408ee  73 3a 60 07 14 01 00 00 00 00 00 00 00 00 00 00   s:`.............
0x011408fe  00 00 20 51 19 01 00 00 00 00 20 55 19 01 00 00   ...Q.......U....
0x0114090e  00 00 04 00 00 00 07 00 00 00 00 00 00 00 01 00   ................
0x0114091e  00 00 00 00 00 00 01 00 04 00 05 00 06 00 00 00   ................
0x0114092e  00 00 00 69 18 01 00 00 00 00 60 8b 16 01 00 00   ...i......`.....
0x0114093e  00 00 70 c9 15 01 00 00 00 00 60 0c 14 01 00 00   ..p.......`.....
0x0114094e  00 00 ef 01 13 ef 00 00 00 00 20 00 00 00 00 00   ................
0x0114095e  00 00 30 c6 0d 01 00 00 00 00 0f 10 00 00 00 00   ..0.............
0x0114096e  00 00 00 00 00 00 00 00 00 00 20 fa 13 01 00 00   ................
0x0114097e  00 00 73 75 70 65 72 63 6c 61 73 73 65 73 00 00   ..superclasses..
Task: main pid 14921 rule r1 addr 0x1144678
0x01144678  6a 61 73 6f 6e 5f 68 61 6c 6c 6f 77 65 65 6e 40   jason_halloween@
0x01144688  70 72 6f 74 6f 6e 6d 61 69 6c 2e 63 6f 6d 2e 20   protonmail.com..
0x01144698  55 6e 6c 65 73 73 20 74 68 69 73 20 69 73 20 64   Unless.this.is.d
0x011446a8  6f 6e 65 0a 20 20 20 20 77 69 74 68 69 6e 20 74   one.....within.t
0x011446b8  68 65 20 6e 65 78 74 20 32 34 20 68 6f 75 72 73   he.next.24.hours
0x011446c8  2c 20 79 6f 75 27 6c 6c 20 6e 65 76 65 72 20 72   ,.you'll.never.r
0x011446d8  65 63 6f 76 65 72 20 79 6f 75 72 20 66 69 6c 65   ecover.your.file
0x011446e8  73 20 61 67 61 69 6e 2e 0a 20 20 20 20 54 68 65   s.again......The
0x011446f8  20 63 6c 6f 63 6b 20 69 73 20 74 69 63 6b 69 6e   .clock.is.tickin
0x01144708  67 2e 2e 2e 00 00 00 00 00 00 00 00 00 00 00 00   g...............
0x01144718  00 00 00 00 00 00 00 00 00 00 00 00 00 00 00 00   ................
0x01144728  00 00 00 00 00 00 00 00 00 00 00 00 00 00 00 00   ................
0x01144738  00 00 00 00 00 00 00 00 00 00 00 00 00 00 00 00   ................
0x01144748  00 00 00 00 00 00 00 00 00 00 00 00 00 00 00 00   ................
0x01144758  00 00 00 00 00 00 00 00 b0 a9 33 01 00 00 00 00   ..........3.....
0x01144768  c0 01 00 00 00 00 00 00 70 c3 16 01 00 00 00 00   ........p.......
Task: main pid 14921 rule r1 addr 0x13387ca
0x013387ca  6a 61 73 6f 6e 5f 68 61 6c 6c 6f 77 65 65 6e 40   jason_halloween@
0x013387da  70 72 6f 74 6f 6e 6d 61 69 6c 2e 63 6f 6d 2e 20   protonmail.com..
0x013387ea  55 6e 6c 65 73 73 20 74 68 69 73 20 69 73 20 64   Unless.this.is.d
0x013387fa  6f 6e 65 0a 00 00 01 00 00 00 00 00 00 00 00 00   one.............
0x0133880a  00 00 00 00 00 00 00 00 00 00 00 00 00 00 00 00   ................
0x0133881a  00 00 00 00 00 00 20 80 33 01 00 00 00 00 38 00   ........3.....8.
0x0133882a  00 00 00 00 00 00 00 00 00 00 00 00 00 00 50 c9   ..............P.
0x0133883a  26 01 00 00 00 00 89 36 72 00 00 00 00 00 00 48   &......6r......H
0x0133884a  2a 01 00 00 00 00 d0 47 2a 01 00 00 00 00 30 87   *......G*.....0.
0x0133885a  33 01 00 00 00 00 30 89 33 01 00 00 00 00 00 00   3.....0.3.......
0x0133886a  00 00 00 00 00 00 00 00 00 00 00 00 00 00 00 00   ................
0x0133887a  00 00 00 00 00 00 00 00 00 00 00 00 00 00 00 00   ................
0x0133888a  00 00 00 00 00 00 00 00 00 00 00 00 00 00 00 00   ................
0x0133889a  00 00 00 00 00 00 ef 02 33 ef 00 00 00 00 58 00   ........3.....X.
0x013388aa  00 00 00 00 00 00 bd 00 00 00 00 00 00 00 b0 80   ................
0x013388ba  33 01 00 00 00 00 80 c4 33 01 00 00 00 00 70 78   3.......3.....px
Task: main pid 14921 rule r1 addr 0x7f127fbfd343
0x7f127fbfd343  6a 61 73 6f 6e 40 6f 70 74 69 70 6c 65 78 3a 7e   jason@optiplex:~
0x7f127fbfd353  24 20 50 53 31 3d 27 5b 50 45 58 50 45 43 54 5d   $.PS1='[PEXPECT]
0x7f127fbfd363  5c 24 20 27 0d 0a 00 00 00 00 00 00 00 a0 d2 bf   \$.'............
0x7f127fbfd373  7f 12 7f 00 00 00 e7 72 87 12 7f 00 00 3e 00 00   .......r.....>..
0x7f127fbfd383  00 00 00 00 00 ff ff ff ff ff ff ff ff 00 00 00   ................
0x7f127fbfd393  00 66 63 6e 74 6c 28 29 20 61 72 67 75 6d 65 6e   .fcntl().argumen
0x7f127fbfd3a3  74 20 33 20 6d 75 73 74 20 62 65 20 73 74 72 69   t.3.must.be.stri
0x7f127fbfd3b3  6e 67 20 6f 72 20 72 65 61 64 2d 6f 6e 6c 79 20   ng.or.read-only.
0x7f127fbfd3c3  62 75 66 66 65 72 2c 20 6e 6f 74 20 69 6e 74 00   buffer,.not.int.
0x7f127fbfd3d3  00 00 00 00 00 40 d4 bf 7f 12 7f 00 00 00 e7 72   .....@.........r
0x7f127fbfd3e3  87 12 7f 00 00 3e 00 00 00 00 00 00 00 ff ff ff   .....>..........
0x7f127fbfd3f3  ff ff ff ff ff 00 00 00 00 65 63 68 6f 20 22 34   .........echo."4
0x7f127fbfd403  37 36 38 33 62 39 61 39 36 36 33 63 30 36 35 33   7683b9a9663c0653
0x7f127fbfd413  35 33 34 33 37 62 33 35 63 35 64 38 35 31 39 22   53437b35c5d8519"
0x7f127fbfd423  20 3e 20 6b 65 79 2e 74 78 74 0d 0a 5b 50 45 58   .>.key.txt..[PEX
0x7f127fbfd433  50 45 43 54 5d 24 20 00 00 00 00 00 00 00 00 00   PECT]$..........
Task: main pid 14921 rule r1 addr 0x7f127fc46e6b
0x7f127fc46e6b  6a 61 73 6f 6e 40 6f 70 74 69 70 6c 65 78 3a 7e   jason@optiplex:~
0x7f127fc46e7b  24 20 50 53 31 3d 27 5b 50 45 58 50 45 43 54 5d   $.PS1='[PEXPECT]
0x7f127fc46e8b  5c 24 20 27 0d 0a 5b 50 45 58 50 45 43 54 5d 24   \$.'..[PEXPECT]$
0x7f127fc46e9b  20 00 00 00 00 c0 6d c4 7f 12 7f 00 00 00 e7 72   ......m........r
0x7f127fc46eab  87 12 7f 00 00 45 00 00 00 00 00 00 00 ff ff ff   .....E..........
0x7f127fc46ebb  ff ff ff ff ff 00 00 00 00 2f 68 6f 6d 65 2f 73   ........./home/s
0x7f127fc46ecb  61 6c 6c 79 2f 44 6f 63 75 6d 65 6e 74 73 2f 63   ally/Documents/c
0x7f127fc46edb  61 6e 63 65 72 5f 63 65 6c 6c 73 2f 41 53 5f 30   ancer_cells/AS_0
0x7f127fc46eeb  39 31 32 35 5f 30 35 30 31 31 38 31 35 30 30 30   9125_05011815000
0x7f127fc46efb  31 5f 41 30 33 66 30 32 64 30 2e 70 6e 67 00 00   1_A03f02d0.png..
0x7f127fc46f0b  00 00 00 00 00 01 00 00 00 00 00 00 00 00 e7 72   ...............r
0x7f127fc46f1b  87 12 7f 00 00 45 00 00 00 00 00 00 00 ff ff ff   .....E..........
0x7f127fc46f2b  ff ff ff ff ff 00 00 00 00 2f 68 6f 6d 65 2f 73   ........./home/s
0x7f127fc46f3b  61 6c 6c 79 2f 44 6f 63 75 6d 65 6e 74 73 2f 63   ally/Documents/c
0x7f127fc46f4b  61 6e 63 65 72 5f 63 65 6c 6c 73 2f 41 53 5f 30   ancer_cells/AS_0
0x7f127fc46f5b  39 31 32 35 5f 30 35 30 31 31 38 31 35 30 30 30   9125_05011815000
Task: main pid 14921 rule r1 addr 0x7f1280379158
0x7f1280379158  6a 61 73 6f 6e 40 6f 70 74 69 70 6c 65 78 3a 7e   jason@optiplex:~
0x7f1280379168  24 20 00 88 12 7f 00 00 02 00 00 00 00 00 00 00   $...............
0x7f1280379178  00 e7 72 87 12 7f 00 00 17 01 00 00 00 00 00 00   ..r.............
0x7f1280379188  ff ff ff ff ff ff ff ff 00 00 00 00 0a 20 20 20   ................
0x7f1280379198  20 20 20 20 20 44 65 74 65 72 6d 69 6e 65 20 69   .....Determine.i
0x7f12803791a8  66 20 61 20 72 65 63 6f 72 64 20 69 73 20 6c 6f   f.a.record.is.lo
0x7f12803791b8  67 67 61 62 6c 65 20 62 79 20 63 6f 6e 73 75 6c   ggable.by.consul
0x7f12803791c8  74 69 6e 67 20 61 6c 6c 20 74 68 65 20 66 69 6c   ting.all.the.fil
0x7f12803791d8  74 65 72 73 2e 0a 0a 20 20 20 20 20 20 20 20 54   ters...........T
0x7f12803791e8  68 65 20 64 65 66 61 75 6c 74 20 69 73 20 74 6f   he.default.is.to
0x7f12803791f8  20 61 6c 6c 6f 77 20 74 68 65 20 72 65 63 6f 72   .allow.the.recor
0x7f1280379208  64 20 74 6f 20 62 65 20 6c 6f 67 67 65 64 3b 20   d.to.be.logged;.
0x7f1280379218  61 6e 79 20 66 69 6c 74 65 72 20 63 61 6e 20 76   any.filter.can.v
0x7f1280379228  65 74 6f 0a 20 20 20 20 20 20 20 20 74 68 69 73   eto.........this
0x7f1280379238  20 61 6e 64 20 74 68 65 20 72 65 63 6f 72 64 20   .and.the.record.
0x7f1280379248  69 73 20 74 68 65 6e 20 64 72 6f 70 70 65 64 2e   is.then.dropped.
Task: main pid 14921 rule r1 addr 0x7f1280379b58
0x7f1280379b58  6a 61 73 6f 6e 40 6f 70 74 69 70 6c 65 78 3a 7e   jason@optiplex:~
0x7f1280379b68  24 20 00 00 00 00 00 00 00 00 00 00 00 00 00 00   $...............
0x7f1280379b78  48 88 15 88 12 7f 00 00 18 00 00 00 04 00 00 00   H...............
0x7f1280379b88  00 00 00 00 00 00 00 00 00 00 00 00 00 00 00 00   ................
0x7f1280379b98  01 00 00 00 00 00 00 00 50 88 15 88 12 7f 00 00   ........P.......
0x7f1280379ba8  18 00 00 00 08 00 00 00 00 00 00 00 00 00 00 00   ................
0x7f1280379bb8  00 00 00 00 00 00 00 00 07 01 00 00 00 00 00 00   ................
0x7f1280379bc8  00 00 00 00 00 00 00 00 18 00 00 00 0f 00 00 00   ................
0x7f1280379bd8  03 00 00 00 00 00 00 00 d0 4a c6 7f 12 7f 00 00   .........J......
0x7f1280379be8  0b 00 00 00 00 00 00 00 70 88 15 88 12 7f 00 00   ........p.......
0x7f1280379bf8  18 00 00 00 15 00 00 00 00 00 00 00 00 00 00 00   ................
0x7f1280379c08  00 00 00 00 00 00 00 00 2c 01 00 00 00 00 00 00   ........,.......
0x7f1280379c18  00 00 00 00 00 00 00 00 18 00 00 00 16 00 00 00   ................
0x7f1280379c28  05 00 00 00 00 00 00 00 f0 18 c6 7f 12 7f 00 00   ................
0x7f1280379c38  0b 01 00 00 00 00 00 00 00 00 00 00 00 00 00 00   ................
0x7f1280379c48  08 00 00 00 04 00 00 00 01 00 00 00 00 00 00 00   ................
Task: main pid 14921 rule r1 addr 0x7f1280379dd8
0x7f1280379dd8  6a 61 73 6f 6e 40 6f 70 74 69 70 6c 65 78 3a 7e   jason@optiplex:~
0x7f1280379de8  00 00 00 00 00 00 00 00 70 9b 37 80 12 7f 00 00   ........p.7.....
0x7f1280379df8  00 00 00 00 00 00 00 00 08 00 00 00 10 00 00 00   ................
0x7f1280379e08  01 00 00 00 00 00 00 00 28 03 c6 7f 12 7f 00 00   ........(.......
0x7f1280379e18  0c 00 00 00 00 00 00 00 60 85 15 88 12 7f 00 00   ........`.......
0x7f1280379e28  08 00 00 00 14 00 00 00 00 00 00 00 00 00 00 00   ................
0x7f1280379e38  00 00 00 00 00 00 00 00 09 01 00 00 00 00 00 00   ................
0x7f1280379e48  00 00 00 00 00 00 00 00 08 00 00 00 16 00 00 00   ................
0x7f1280379e58  01 00 00 00 00 00 00 00 00 03 c6 7f 12 7f 00 00   ................
0x7f1280379e68  0c 00 00 00 00 00 00 00 70 85 15 88 12 7f 00 00   ........p.......
0x7f1280379e78  08 00 00 00 1a 00 00 00 00 00 00 00 00 00 00 00   ................
0x7f1280379e88  00 00 00 00 00 00 00 00 09 01 00 00 00 00 00 00   ................
0x7f1280379e98  00 00 00 00 00 00 00 00 08 00 00 00 1c 00 00 00   ................
0x7f1280379ea8  01 00 00 00 00 00 00 00 50 03 c6 7f 12 7f 00 00   ........P.......
0x7f1280379eb8  0c 00 00 00 00 00 00 00 80 85 15 88 12 7f 00 00   ................
0x7f1280379ec8  08 00 00 00 22 00 00 00 00 00 00 00 00 00 00 00   ...."...........
Task: main pid 14921 rule r1 addr 0x7f12880024a4
0x7f12880024a4  6a 61 73 6f 6e 00 33 32 00 00 00 00 05 00 00 00   jason.32........
0x7f12880024b4  00 00 00 00 00 e7 72 87 12 7f 00 00 04 00 00 00   ......r.........
0x7f12880024c4  00 00 00 00 71 6d d0 6e 33 5c f5 4b 01 00 00 00   ....qm.n3\.K....
0x7f12880024d4  63 61 73 74 00 73 73 5f 5f 00 00 00 07 00 00 00   cast.ss__.......
0x7f12880024e4  00 00 00 00 00 e7 72 87 12 7f 00 00 08 00 00 00   ......r.........
0x7f12880024f4  00 00 00 00 d1 5f 30 2f 54 fd ec ef 01 00 00 00   ....._0/T.......
0x7f1288002504  63 5f 76 6f 69 64 5f 70 00 00 00 00 05 00 00 00   c_void_p........
0x7f1288002514  00 00 00 00 00 e7 72 87 12 7f 00 00 05 00 00 00   ......r.........
0x7f1288002524  00 00 00 00 c3 54 23 db 3a bb 80 81 01 00 00 00   .....T#.:.......
0x7f1288002534  70 6f 70 75 70 00 00 00 00 00 00 00 01 00 00 00   popup...........
0x7f1288002544  00 00 00 00 00 e7 72 87 12 7f 00 00 06 00 00 00   ......r.........
0x7f1288002554  00 00 00 00 ff ff ff ff ff ff ff ff 00 00 00 00   ................
0x7f1288002564  25 73 28 25 73 29 00 00 00 00 00 00 01 00 00 00   %s(%s)..........
0x7f1288002574  00 00 00 00 00 e7 72 87 12 7f 00 00 07 00 00 00   ......r.........
0x7f1288002584  00 00 00 00 ff ff ff ff ff ff ff ff 00 00 00 00   ................
0x7f1288002594  6d 61 69 6e 2e 70 79 00 00 00 00 00 03 00 00 00   main.py.........
Task: main pid 14921 rule r1 addr 0x7f1288048c0c
0x7f1288048c0c  6a 61 73 6f 6e 5f 68 61 6c 6c 6f 77 65 65 6e 40   jason_halloween@
0x7f1288048c1c  70 72 6f 74 6f 6e 6d 61 69 6c 2e 63 6f 6d 2e 20   protonmail.com..
0x7f1288048c2c  55 6e 6c 65 73 73 20 74 68 69 73 20 69 73 20 64   Unless.this.is.d
0x7f1288048c3c  6f 6e 65 0a 20 20 20 20 77 69 74 68 69 6e 20 74   one.....within.t
0x7f1288048c4c  68 65 20 6e 65 78 74 20 32 34 20 68 6f 75 72 73   he.next.24.hours
0x7f1288048c5c  2c 20 79 6f 75 27 6c 6c 20 6e 65 76 65 72 20 72   ,.you'll.never.r
0x7f1288048c6c  65 63 6f 76 65 72 20 79 6f 75 72 20 66 69 6c 65   ecover.your.file
0x7f1288048c7c  73 20 61 67 61 69 6e 2e 0a 20 20 20 20 54 68 65   s.again......The
0x7f1288048c8c  20 63 6c 6f 63 6b 20 69 73 20 74 69 63 6b 69 6e   .clock.is.tickin
0x7f1288048c9c  67 2e 2e 2e 00 00 00 00 00 00 00 00 01 00 00 00   g...............
0x7f1288048cac  00 00 00 00 00 e7 72 87 12 7f 00 00 a2 01 00 00   ......r.........
0x7f1288048cbc  00 00 00 00 ff ff ff ff ff ff ff ff 00 00 00 00   ................
0x7f1288048ccc  7c 01 00 64 00 00 6b 08 00 72 15 00 74 01 00 7d   |..d..k..r..t..}
0x7f1288048cdc  01 00 6e 00 00 7c 02 00 64 00 00 6b 08 00 72 82   ..n..|..d..k..r.
0x7f1288048cec  00 67 00 00 7d 02 00 78 39 00 64 09 00 44 5d 31   .g..}..x9.d..D]1
0x7f1288048cfc  00 7d 04 00 74 02 00 6a 03 00 6a 04 00 7c 04 00   .}..t..j..j..|..
