{
  "driver_id": "1",
  "version": "1",
  "active": true,
  "dev_key": "29c929e43acd69cc530e93b00f807c11",
  "vendor": "METI M2M India Pvt Ltd",
  "meter": "QuickIoT_BulkHead_NLL",
  "name": "QuickIoT_BulkHead_NLL",
  "serial": {
    "baud": "4",
    "databits": "8",
    "parity": "0",
    "stopbits": "1"
  },
  "command": {
    "slaveId": "10",
    "function": "3",
    "startAddr": "2",
    "regCount": "1",
    "timeOut": "300",
    "retries": "3",
    "repeat_int": "3",
    "responseParser": {
      "sensor_100": {
        "id": "100",
        "nm": "Resistance",
        "un": "mV",
        "rg": "2",
        "ra": "2",
        "dt": "10",
        "bo": "5",
        "sn": "1",
        "sd": "1",
        "dp": "2",
        "os": "0.000",
        "do": "99",
        "cv": "0.00",
        "ac": true,
        "di": false,
        "tx": false
      },
      "sensor_101": {
        "id": "101",
        "nm": "Level",
        "un": "%",
        "rg": "2",
        "ra": "2",
        "dt": "10",
        "bo": "5",
        "sn": "1",
        "sd": "1",
        "dp": "1",
        "os": "0.000",
        "do": "99",
        "cv": "0.00",
        "ac": true,
        "di": true,
        "tx": true
      },
      "sensor_102": {
        "id": "102",
        "nm": "Height",
        "un": "Cms",
        "rg": "2",
        "ra": "2",
        "dt": "10",
        "bo": "5",
        "sn": "1",
        "sd": "1",
        "dp": "2",
        "os": "0.000",
        "do": "99",
        "cv": "0.00",
        "ac": true,
        "di": true,
        "tx": true
      },
      "sensor_103": {
        "id": "103",
        "nm": "Volume",
        "un": "Ltrs",
        "rg": "2",
        "ra": "2",
        "dt": "10",
        "bo": "5",
        "sn": "1",
        "sd": "1",
        "dp": "2",
        "os": "0.000",
        "do": "99",
        "cv": "0.00",
        "ac": true,
        "di": true,
        "tx": true
      },
      "sensor_104": {
        "id": "104",
        "nm": "Volume%",
        "un": "%",
        "rg": "2",
        "ra": "2",
        "dt": "10",
        "bo": "5",
        "sn": "1",
        "sd": "1",
        "dp": "4",
        "os": "0.000",
        "do": "99",
        "cv": "0.00",
        "ac": true,
        "di": true,
        "tx": true
      },
      "sensor_105": {
        "id": "105",
        "nm": "Value5",
        "un": "V5",
        "rg": "2",
        "ra": "2",
        "dt": "10",
        "bo": "5",
        "sn": "1",
        "sd": "1",
        "dp": "3",
        "os": "0.000",
        "do": "99",
        "cv": "0.00",
        "ac": true,
        "di": false,
        "tx": true
      },
      "sensor_106": {
        "id": "106",
        "nm": "Value6",
        "un": "V6",
        "rg": "2",
        "ra": "2",
        "dt": "10",
        "bo": "5",
        "sn": "1",
        "sd": "1",
        "dp": "2",
        "os": "0.000",
        "do": "99",
        "cv": "0.00",
        "ac": true,
        "di": false,
        "tx": true
      }
    }
  }
}