{
    "device": {
        "restart_count": "1",
        "on_time": "2",
        "wifi_err_count": "3",
        "no_wifi_time": "4"
    },
    "router": {
        "restart_count": "5",
        "on_time": "6",
        "internet_err_count": "7",
        "no_internet_time": "8"
    }
}