{
  "driver_id": "3",
  "version": "1",
  "active": false,
  "dev_key": "0a192f075ba72d08aef147ecd471d0aa",
  "vendor": "METI",
  "meter": "Custom",
  "name": "Custom Driver",
  "serial": {
    "baud": "4",
    "databits": "8",
    "parity": "0",
    "stopbits": "1"
  },
  "command": {
    "slaveId": "7",
    "function": "4",
    "startAddr": "0",
    "regCount": "4",
    "timeOut": "300",
    "retries": "3",
    "repeat_int": "3",
    "responseParser": {
      "sensor_0": {
        "id": "11964",
        "nm": "Temp1",
        "un": "degC",
        "rg": "2",
        "ra": "0",
        "dt": "9",
        "bo": "5",
        "sn": "1",
        "sd": "10",
        "dp": "2",
        "os": "0.000",
        "do": "1",
        "cv": "0.00",
        "ac": true,
        "di": true,
        "tx": true
      },
      "sensor_1": {
        "id": "11965",
        "nm": "Temp2",
        "un": "degC",
        "rg": "2",
        "ra": "1",
        "dt": "9",
        "bo": "5",
        "sn": "1",
        "sd": "10",
        "dp": "2",
        "os": "0.000",
        "do": "1",
        "cv": "0.00",
        "ac": true,
        "di": true,
        "tx": true
      },
      "sensor_2": {
        "id": "11966",
        "nm": "Temp3",
        "un": "degC",
        "rg": "2",
        "ra": "2",
        "dt": "9",
        "bo": "5",
        "sn": "1",
        "sd": "10",
        "dp": "2",
        "os": "0.000",
        "do": "1",
        "cv": "0.00",
        "ac": true,
        "di": true,
        "tx": true
      },
      "sensor_3": {
        "id": "11967",
        "nm": "Temp4",
        "un": "degC",
        "rg": "2",
        "ra": "3",
        "dt": "9",
        "bo": "5",
        "sn": "1",
        "sd": "10",
        "dp": "2",
        "os": "0.000",
        "do": "1",
        "cv": "0.00",
        "ac": true,
        "di": true,
        "tx": true
      }
    }
  }
}