Loading plugins phase: Elapsed time ==> 0s.234ms
<CYPRESSTAG name="CyDsfit arguments...">
cydsfit arguments: -.fdsnotice -.fdswarpdepfile=warp_dependencies.txt -.fdselabdepfile=elab_dependencies.txt -.fdsbldfile=generated_files.txt -.fdsreffile=referenced_files.txt -p C:\METI\Firmware Varun\055 Smart Gloves\Smart Gloves\Smart_gloves_uinsg_mux.cydsn\Smart_gloves_uinsg_mux.cyprj -d CY8C4245PVI-482 -s C:\METI\Firmware Varun\055 Smart Gloves\Smart Gloves\Smart_gloves_uinsg_mux.cydsn\Generated_Source\PSoC4 -- -yv2 -q10 -ygs -o2 -v3 -.fftcfgtype=LE
</CYPRESSTAG>
<CYPRESSTAG name="Design elaboration results...">
ADD: sdb.M0061: information: Info from component: ADC_Flex. The actual sample rate (2929 SPS) differs from the desired sample rate (3000 SPS) due to the clock configuration in the DWR.
 * C:\METI\Firmware Varun\055 Smart Gloves\Smart Gloves\Smart_gloves_uinsg_mux.cydsn\TopDesign\TopDesign.cysch (Instance:ADC_Flex)

</CYPRESSTAG>
Elaboration phase: Elapsed time ==> 2s.610ms
<CYPRESSTAG name="HDL generation results...">
</CYPRESSTAG>
HDL generation phase: Elapsed time ==> 0s.093ms
<CYPRESSTAG name="Synthesis results...">

     | | | | | | |
   _________________
  -|               |-
  -|               |-
  -|               |-
  -|    CYPRESS    |-
  -|               |-
  -|               |-   Warp Verilog Synthesis Compiler: Version 6.3 IR 41
  -|               |-   Copyright (C) 1991-2001 Cypress Semiconductor
   |_______________|
     | | | | | | |

======================================================================
Compiling:  Smart_gloves_uinsg_mux.v
Program  :   C:\Program Files (x86)\Cypress\PSoC Creator\4.4\PSoC Creator\warp\bin\warp.exe
Options  :    -yv2 -q10 -ygs -o2 -v3 -.fftcfgtype=LE -ya -.fftprj=C:\METI\Firmware Varun\055 Smart Gloves\Smart Gloves\Smart_gloves_uinsg_mux.cydsn\Smart_gloves_uinsg_mux.cyprj -dcpsoc3 Smart_gloves_uinsg_mux.v -verilog
======================================================================

======================================================================
Compiling:  Smart_gloves_uinsg_mux.v
Program  :   C:\Program Files (x86)\Cypress\PSoC Creator\4.4\PSoC Creator\warp\bin\warp.exe
Options  :    -yv2 -q10 -ygs -o2 -v3 -.fftcfgtype=LE -ya -.fftprj=C:\METI\Firmware Varun\055 Smart Gloves\Smart Gloves\Smart_gloves_uinsg_mux.cydsn\Smart_gloves_uinsg_mux.cyprj -dcpsoc3 Smart_gloves_uinsg_mux.v -verilog
======================================================================

======================================================================
Compiling:  Smart_gloves_uinsg_mux.v
Program  :   vlogfe
Options  :    -yv2 -q10 -ygs -o2 -v3 -.fftcfgtype=LE -ya -.fftprj=C:\METI\Firmware Varun\055 Smart Gloves\Smart Gloves\Smart_gloves_uinsg_mux.cydsn\Smart_gloves_uinsg_mux.cyprj -dcpsoc3 -verilog Smart_gloves_uinsg_mux.v
======================================================================

vlogfe V6.3 IR 41:  Verilog parser
Sun Apr 17 22:32:03 2022


======================================================================
Compiling:  Smart_gloves_uinsg_mux.v
Program  :   vpp
Options  :    -yv2 -q10 Smart_gloves_uinsg_mux.v
======================================================================

vpp V6.3 IR 41:  Verilog Pre-Processor
Sun Apr 17 22:32:03 2022

Flattening file 'C:\Program Files (x86)\Cypress\PSoC Creator\4.4\PSoC Creator\psoc\content\CyPrimitives\cyprimitives.cylib\ZeroTerminal\ZeroTerminal.v'
Flattening file 'C:\Program Files (x86)\Cypress\PSoC Creator\4.4\PSoC Creator\psoc\content\CyPrimitives\cyprimitives.cylib\or_v1_0\or_v1_0.v'
Flattening file 'C:\Program Files (x86)\Cypress\PSoC Creator\4.4\PSoC Creator\psoc\content\CyPrimitives\cyprimitives.cylib\cy_analog_virtualmux_v1_0\cy_analog_virtualmux_v1_0.v'
Flattening file 'C:\Program Files (x86)\Cypress\PSoC Creator\4.4\PSoC Creator\psoc\content\CyComponentLibrary\CyComponentLibrary.cylib\Bus_Connect_v2_50\Bus_Connect_v2_50.v'
Flattening file 'C:\Program Files (x86)\Cypress\PSoC Creator\4.4\PSoC Creator\warp\lib\common\cypress.v'
Flattening file 'C:\Program Files (x86)\Cypress\PSoC Creator\4.4\PSoC Creator\warp\lib\common\cy_psoc3_inc.v'
Flattening file 'C:\Program Files (x86)\Cypress\PSoC Creator\4.4\PSoC Creator\psoc\content\CyPrimitives\cyprimitives.cylib\cy_virtualmux_v1_0\cy_virtualmux_v1_0.v'
Flattening file 'C:\Program Files (x86)\Cypress\PSoC Creator\4.4\PSoC Creator\psoc\content\CyComponentLibrary\CyComponentLibrary.cylib\AMux_v1_80\AMux_v1_80.v'
Flattening file 'C:\Program Files (x86)\Cypress\PSoC Creator\4.4\PSoC Creator\warp\lib\common\cypress.v'
Flattening file 'C:\Program Files (x86)\Cypress\PSoC Creator\4.4\PSoC Creator\psoc\content\CyComponentLibrary\CyComponentLibrary.cylib\B_Timer_v2_80\B_Timer_v2_80.v'
Flattening file 'C:\Program Files (x86)\Cypress\PSoC Creator\4.4\PSoC Creator\warp\lib\common\cypress.v'

vpp:  No errors.

Library 'work' => directory 'lcpsoc3'
General_symbol_table
General_symbol_table
Linking 'C:\Program Files (x86)\Cypress\PSoC Creator\4.4\PSoC Creator\warp\lib\common\std.vhd'.
Linking 'C:\Program Files (x86)\Cypress\PSoC Creator\4.4\PSoC Creator\warp\lib\common\cypress.vhd'.
Linking 'C:\Program Files (x86)\Cypress\PSoC Creator\4.4\PSoC Creator\warp\lib\common\work\cypress.vif'.
Linking 'C:\Program Files (x86)\Cypress\PSoC Creator\4.4\PSoC Creator\warp\lib\ieee\work\stdlogic.vif'.
Linking 'C:\Program Files (x86)\Cypress\PSoC Creator\4.4\PSoC Creator\warp\lib\common\stdlogic\lpmpkg.vif'.
Linking 'C:\Program Files (x86)\Cypress\PSoC Creator\4.4\PSoC Creator\warp\lib\common\stdlogic\rtlpkg.vif'.
Linking 'C:\Program Files (x86)\Cypress\PSoC Creator\4.4\PSoC Creator\warp\lib\common\stdlogic\mod_cnst.vif'.
Linking 'C:\Program Files (x86)\Cypress\PSoC Creator\4.4\PSoC Creator\warp\lib\common\stdlogic\mod_mthv.vif'.
Linking 'C:\Program Files (x86)\Cypress\PSoC Creator\4.4\PSoC Creator\warp\lib\common\stdlogic\mod_genv.vif'.
Using control file 'Smart_gloves_uinsg_mux.ctl'.
C:\Program Files (x86)\Cypress\PSoC Creator\4.4\PSoC Creator\psoc\content\CyComponentLibrary\CyComponentLibrary.cylib\B_Timer_v2_80\B_Timer_v2_80.v (line 368, col 46):  Note: Substituting module 'cmp_vv_vv' for '='.
C:\Program Files (x86)\Cypress\PSoC Creator\4.4\PSoC Creator\psoc\content\CyComponentLibrary\CyComponentLibrary.cylib\B_Timer_v2_80\B_Timer_v2_80.v (line 374, col 62):  Note: Substituting module 'add_vv_vv' for '+'.
Linking 'C:\Program Files (x86)\Cypress\PSoC Creator\4.4\PSoC Creator\warp\lib\common\stdlogic\cy_psoc3pkg.vif'.
Linking 'C:\Program Files (x86)\Cypress\PSoC Creator\4.4\PSoC Creator\warp\lib\common\stdlogic\cy_psoc3.vif'.

vlogfe:  No errors.


======================================================================
Compiling:  Smart_gloves_uinsg_mux.v
Program  :   tovif
Options  :    -yv2 -q10 -ygs -o2 -v3 -.fftcfgtype=LE -ya -.fftprj=C:\METI\Firmware Varun\055 Smart Gloves\Smart Gloves\Smart_gloves_uinsg_mux.cydsn\Smart_gloves_uinsg_mux.cyprj -dcpsoc3 -verilog Smart_gloves_uinsg_mux.v
======================================================================

tovif V6.3 IR 41:  High-level synthesis
Sun Apr 17 22:32:04 2022

Linking 'C:\Program Files (x86)\Cypress\PSoC Creator\4.4\PSoC Creator\warp\lib\common\std.vhd'.
Linking 'C:\Program Files (x86)\Cypress\PSoC Creator\4.4\PSoC Creator\warp\lib\common\cypress.vhd'.
Linking 'C:\Program Files (x86)\Cypress\PSoC Creator\4.4\PSoC Creator\warp\lib\common\work\cypress.vif'.
Linking 'C:\Program Files (x86)\Cypress\PSoC Creator\4.4\PSoC Creator\warp\lib\ieee\work\stdlogic.vif'.
Linking 'C:\Program Files (x86)\Cypress\PSoC Creator\4.4\PSoC Creator\warp\lib\common\stdlogic\lpmpkg.vif'.
Linking 'C:\Program Files (x86)\Cypress\PSoC Creator\4.4\PSoC Creator\warp\lib\common\stdlogic\rtlpkg.vif'.
Linking 'C:\Program Files (x86)\Cypress\PSoC Creator\4.4\PSoC Creator\warp\lib\common\stdlogic\mod_cnst.vif'.
Linking 'C:\Program Files (x86)\Cypress\PSoC Creator\4.4\PSoC Creator\warp\lib\common\stdlogic\mod_mthv.vif'.
Linking 'C:\Program Files (x86)\Cypress\PSoC Creator\4.4\PSoC Creator\warp\lib\common\stdlogic\mod_genv.vif'.
Linking 'C:\METI\Firmware Varun\055 Smart Gloves\Smart Gloves\Smart_gloves_uinsg_mux.cydsn\codegentemp\Smart_gloves_uinsg_mux.ctl'.
Linking 'C:\Program Files (x86)\Cypress\PSoC Creator\4.4\PSoC Creator\psoc\content\CyPrimitives\cyprimitives.cylib\ZeroTerminal\ZeroTerminal.v'.
Linking 'C:\METI\Firmware Varun\055 Smart Gloves\Smart Gloves\Smart_gloves_uinsg_mux.cydsn\codegentemp\Smart_gloves_uinsg_mux.v'.
Linking 'C:\Program Files (x86)\Cypress\PSoC Creator\4.4\PSoC Creator\psoc\content\CyPrimitives\cyprimitives.cylib\or_v1_0\or_v1_0.v'.
Linking 'C:\Program Files (x86)\Cypress\PSoC Creator\4.4\PSoC Creator\psoc\content\CyPrimitives\cyprimitives.cylib\cy_analog_virtualmux_v1_0\cy_analog_virtualmux_v1_0.v'.
Linking 'C:\Program Files (x86)\Cypress\PSoC Creator\4.4\PSoC Creator\psoc\content\CyComponentLibrary\CyComponentLibrary.cylib\Bus_Connect_v2_50\Bus_Connect_v2_50.v'.
Linking 'C:\Program Files (x86)\Cypress\PSoC Creator\4.4\PSoC Creator\warp\lib\common\cypress.v'.
Linking 'C:\Program Files (x86)\Cypress\PSoC Creator\4.4\PSoC Creator\warp\lib\common\cy_psoc3_inc.v'.
Linking 'C:\Program Files (x86)\Cypress\PSoC Creator\4.4\PSoC Creator\psoc\content\CyPrimitives\cyprimitives.cylib\cy_virtualmux_v1_0\cy_virtualmux_v1_0.v'.
Linking 'C:\Program Files (x86)\Cypress\PSoC Creator\4.4\PSoC Creator\psoc\content\CyComponentLibrary\CyComponentLibrary.cylib\AMux_v1_80\AMux_v1_80.v'.
Linking 'C:\Program Files (x86)\Cypress\PSoC Creator\4.4\PSoC Creator\psoc\content\CyComponentLibrary\CyComponentLibrary.cylib\B_Timer_v2_80\B_Timer_v2_80.v'.
Linking 'C:\Program Files (x86)\Cypress\PSoC Creator\4.4\PSoC Creator\warp\lib\common\stdlogic\cy_psoc3pkg.vif'.
Linking 'C:\Program Files (x86)\Cypress\PSoC Creator\4.4\PSoC Creator\warp\lib\common\stdlogic\cy_psoc3.vif'.

tovif:  No errors.


======================================================================
Compiling:  Smart_gloves_uinsg_mux.v
Program  :   topld
Options  :    -yv2 -q10 -ygs -o2 -v3 -.fftcfgtype=LE -ya -.fftprj=C:\METI\Firmware Varun\055 Smart Gloves\Smart Gloves\Smart_gloves_uinsg_mux.cydsn\Smart_gloves_uinsg_mux.cyprj -dcpsoc3 -verilog Smart_gloves_uinsg_mux.v
======================================================================

topld V6.3 IR 41:  Synthesis and optimization
Sun Apr 17 22:32:04 2022

Linking 'C:\Program Files (x86)\Cypress\PSoC Creator\4.4\PSoC Creator\warp\lib\common\std.vhd'.
Linking 'C:\Program Files (x86)\Cypress\PSoC Creator\4.4\PSoC Creator\warp\lib\common\cypress.vhd'.
Linking 'C:\Program Files (x86)\Cypress\PSoC Creator\4.4\PSoC Creator\warp\lib\common\work\cypress.vif'.
Linking 'C:\Program Files (x86)\Cypress\PSoC Creator\4.4\PSoC Creator\warp\lib\ieee\work\stdlogic.vif'.
Linking 'C:\Program Files (x86)\Cypress\PSoC Creator\4.4\PSoC Creator\warp\lib\common\stdlogic\lpmpkg.vif'.
Linking 'C:\Program Files (x86)\Cypress\PSoC Creator\4.4\PSoC Creator\warp\lib\common\stdlogic\rtlpkg.vif'.
Linking 'C:\Program Files (x86)\Cypress\PSoC Creator\4.4\PSoC Creator\warp\lib\common\stdlogic\mod_cnst.vif'.
Linking 'C:\Program Files (x86)\Cypress\PSoC Creator\4.4\PSoC Creator\warp\lib\common\stdlogic\mod_mthv.vif'.
Linking 'C:\Program Files (x86)\Cypress\PSoC Creator\4.4\PSoC Creator\warp\lib\common\stdlogic\mod_genv.vif'.
Linking 'C:\METI\Firmware Varun\055 Smart Gloves\Smart Gloves\Smart_gloves_uinsg_mux.cydsn\codegentemp\Smart_gloves_uinsg_mux.ctl'.
Linking 'C:\Program Files (x86)\Cypress\PSoC Creator\4.4\PSoC Creator\psoc\content\CyPrimitives\cyprimitives.cylib\ZeroTerminal\ZeroTerminal.v'.
Linking 'C:\METI\Firmware Varun\055 Smart Gloves\Smart Gloves\Smart_gloves_uinsg_mux.cydsn\codegentemp\Smart_gloves_uinsg_mux.v'.
Linking 'C:\Program Files (x86)\Cypress\PSoC Creator\4.4\PSoC Creator\psoc\content\CyPrimitives\cyprimitives.cylib\or_v1_0\or_v1_0.v'.
Linking 'C:\Program Files (x86)\Cypress\PSoC Creator\4.4\PSoC Creator\psoc\content\CyPrimitives\cyprimitives.cylib\cy_analog_virtualmux_v1_0\cy_analog_virtualmux_v1_0.v'.
Linking 'C:\Program Files (x86)\Cypress\PSoC Creator\4.4\PSoC Creator\psoc\content\CyComponentLibrary\CyComponentLibrary.cylib\Bus_Connect_v2_50\Bus_Connect_v2_50.v'.
Linking 'C:\Program Files (x86)\Cypress\PSoC Creator\4.4\PSoC Creator\warp\lib\common\cypress.v'.
Linking 'C:\Program Files (x86)\Cypress\PSoC Creator\4.4\PSoC Creator\warp\lib\common\cy_psoc3_inc.v'.
Linking 'C:\Program Files (x86)\Cypress\PSoC Creator\4.4\PSoC Creator\psoc\content\CyPrimitives\cyprimitives.cylib\cy_virtualmux_v1_0\cy_virtualmux_v1_0.v'.
Linking 'C:\Program Files (x86)\Cypress\PSoC Creator\4.4\PSoC Creator\psoc\content\CyComponentLibrary\CyComponentLibrary.cylib\AMux_v1_80\AMux_v1_80.v'.
Linking 'C:\Program Files (x86)\Cypress\PSoC Creator\4.4\PSoC Creator\psoc\content\CyComponentLibrary\CyComponentLibrary.cylib\B_Timer_v2_80\B_Timer_v2_80.v'.
Linking 'C:\Program Files (x86)\Cypress\PSoC Creator\4.4\PSoC Creator\warp\lib\common\stdlogic\cy_psoc3pkg.vif'.
Linking 'C:\Program Files (x86)\Cypress\PSoC Creator\4.4\PSoC Creator\warp\lib\common\stdlogic\cy_psoc3.vif'.
Linking 'C:\Program Files (x86)\Cypress\PSoC Creator\4.4\PSoC Creator\warp\lib\lcpsoc3\stdlogic\cpsoc3.vif'.

----------------------------------------------------------
Detecting unused logic.
----------------------------------------------------------
    User names
	\ADC_Flex:Net_3125\
	\ADC_Flex:Net_3126\
	\EZI2C_Flex:Net_1257\
	\EZI2C_Flex:uncfg_rx_irq\
	\EZI2C_Flex:Net_1099\
	\EZI2C_Flex:Net_1258\
	Net_608
	Net_609
	Net_610
	Net_611
	Net_612
	Net_613
	Net_614
	Net_617
	Net_618
	Net_625
	\Base_Timer:TimerUDB:ctrl_ten\
	\Base_Timer:TimerUDB:ctrl_cmode_0\
	\Base_Timer:TimerUDB:ctrl_tmode_1\
	\Base_Timer:TimerUDB:ctrl_tmode_0\
	\Base_Timer:TimerUDB:ctrl_ic_1\
	\Base_Timer:TimerUDB:ctrl_ic_0\
	Net_647
	\Base_Timer:TimerUDB:zeros_3\
	\Base_Timer:TimerUDB:zeros_2\


Deleted 25 User equations/components.
Deleted 0 Synthesized equations/components.

------------------------------------------------------
Alias Detection
------------------------------------------------------
Aliasing \ADC_Flex:Net_3106\ to \ADC_Flex:Net_3107\
Aliasing \ADC_Flex:Net_3105\ to \ADC_Flex:Net_3107\
Aliasing \ADC_Flex:Net_3104\ to \ADC_Flex:Net_3107\
Aliasing \ADC_Flex:Net_3103\ to \ADC_Flex:Net_3107\
Aliasing \ADC_Flex:Net_3207_1\ to \ADC_Flex:Net_3107\
Aliasing \ADC_Flex:Net_3207_0\ to \ADC_Flex:Net_3107\
Aliasing \ADC_Flex:Net_3235\ to \ADC_Flex:Net_3107\
Aliasing zero to \ADC_Flex:Net_3107\
Aliasing one to \UART:tmpOE__tx_net_0\
Aliasing tmpOE__Flex8_net_0 to \UART:tmpOE__tx_net_0\
Aliasing tmpOE__Flex9_net_0 to \UART:tmpOE__tx_net_0\
Aliasing tmpOE__Flex10_net_0 to \UART:tmpOE__tx_net_0\
Aliasing \EZI2C_Flex:select_s_wire\ to \ADC_Flex:Net_3107\
Aliasing \EZI2C_Flex:rx_wire\ to \ADC_Flex:Net_3107\
Aliasing \EZI2C_Flex:sclk_s_wire\ to \ADC_Flex:Net_3107\
Aliasing \EZI2C_Flex:mosi_s_wire\ to \ADC_Flex:Net_3107\
Aliasing \EZI2C_Flex:miso_m_wire\ to \ADC_Flex:Net_3107\
Aliasing \EZI2C_Flex:tmpOE__sda_net_0\ to \UART:tmpOE__tx_net_0\
Aliasing \EZI2C_Flex:tmpOE__scl_net_0\ to \UART:tmpOE__tx_net_0\
Aliasing \EZI2C_Flex:cts_wire\ to \ADC_Flex:Net_3107\
Aliasing tmpOE__Flex1_net_0 to \UART:tmpOE__tx_net_0\
Aliasing tmpOE__Flex2_net_0 to \UART:tmpOE__tx_net_0\
Aliasing tmpOE__Flex3_net_0 to \UART:tmpOE__tx_net_0\
Aliasing tmpOE__Flex4_net_0 to \UART:tmpOE__tx_net_0\
Aliasing tmpOE__Flex5_net_0 to \UART:tmpOE__tx_net_0\
Aliasing tmpOE__Flex6_net_0 to \UART:tmpOE__tx_net_0\
Aliasing tmpOE__Flex7_net_0 to \UART:tmpOE__tx_net_0\
Aliasing Net_12 to \ADC_Flex:Net_3107\
Aliasing \Base_Timer:TimerUDB:ctrl_cmode_1\ to \ADC_Flex:Net_3107\
Aliasing \Base_Timer:TimerUDB:trigger_enable\ to \UART:tmpOE__tx_net_0\
Aliasing \Base_Timer:TimerUDB:status_6\ to \ADC_Flex:Net_3107\
Aliasing \Base_Timer:TimerUDB:status_5\ to \ADC_Flex:Net_3107\
Aliasing \Base_Timer:TimerUDB:status_4\ to \ADC_Flex:Net_3107\
Aliasing \Base_Timer:TimerUDB:status_0\ to \Base_Timer:TimerUDB:tc_i\
Aliasing \Base_Timer:TimerUDB:capture_last\\D\ to \ADC_Flex:Net_3107\
Aliasing \Base_Timer:TimerUDB:hwEnable_reg\\D\ to \Base_Timer:TimerUDB:run_mode\
Aliasing \Base_Timer:TimerUDB:capture_out_reg_i\\D\ to \Base_Timer:TimerUDB:capt_fifo_load_int\
Removing Lhs of wire \ADC_Flex:Net_3106\[72] = \ADC_Flex:Net_3107\[71]
Removing Lhs of wire \ADC_Flex:Net_3105\[73] = \ADC_Flex:Net_3107\[71]
Removing Lhs of wire \ADC_Flex:Net_3104\[74] = \ADC_Flex:Net_3107\[71]
Removing Lhs of wire \ADC_Flex:Net_3103\[75] = \ADC_Flex:Net_3107\[71]
Removing Lhs of wire \ADC_Flex:Net_17\[117] = \ADC_Flex:Net_1845\[2]
Removing Lhs of wire \ADC_Flex:Net_3207_1\[139] = \ADC_Flex:Net_3107\[71]
Removing Lhs of wire \ADC_Flex:Net_3207_0\[140] = \ADC_Flex:Net_3107\[71]
Removing Lhs of wire \ADC_Flex:Net_3235\[141] = \ADC_Flex:Net_3107\[71]
Removing Rhs of wire zero[212] = \ADC_Flex:Net_3107\[71]
Removing Rhs of wire one[216] = \UART:tmpOE__tx_net_0\[211]
Removing Lhs of wire tmpOE__Flex8_net_0[219] = one[216]
Removing Lhs of wire tmpOE__Flex9_net_0[226] = one[216]
Removing Lhs of wire tmpOE__Flex10_net_0[233] = one[216]
Removing Lhs of wire \EZI2C_Flex:select_s_wire\[241] = zero[212]
Removing Lhs of wire \EZI2C_Flex:rx_wire\[242] = zero[212]
Removing Lhs of wire \EZI2C_Flex:Net_1170\[245] = \EZI2C_Flex:Net_847\[240]
Removing Lhs of wire \EZI2C_Flex:sclk_s_wire\[246] = zero[212]
Removing Lhs of wire \EZI2C_Flex:mosi_s_wire\[247] = zero[212]
Removing Lhs of wire \EZI2C_Flex:miso_m_wire\[248] = zero[212]
Removing Lhs of wire \EZI2C_Flex:tmpOE__sda_net_0\[250] = one[216]
Removing Lhs of wire \EZI2C_Flex:tmpOE__scl_net_0\[256] = one[216]
Removing Lhs of wire \EZI2C_Flex:cts_wire\[265] = zero[212]
Removing Lhs of wire tmpOE__Flex1_net_0[298] = one[216]
Removing Lhs of wire tmpOE__Flex2_net_0[304] = one[216]
Removing Lhs of wire tmpOE__Flex3_net_0[310] = one[216]
Removing Lhs of wire tmpOE__Flex4_net_0[316] = one[216]
Removing Lhs of wire tmpOE__Flex5_net_0[322] = one[216]
Removing Lhs of wire tmpOE__Flex6_net_0[328] = one[216]
Removing Lhs of wire tmpOE__Flex7_net_0[334] = one[216]
Removing Lhs of wire Net_12[341] = zero[212]
Removing Lhs of wire \Base_Timer:TimerUDB:ctrl_enable\[355] = \Base_Timer:TimerUDB:control_7\[347]
Removing Lhs of wire \Base_Timer:TimerUDB:ctrl_cmode_1\[357] = zero[212]
Removing Rhs of wire \Base_Timer:TimerUDB:timer_enable\[366] = \Base_Timer:TimerUDB:runmode_enable\[379]
Removing Rhs of wire \Base_Timer:TimerUDB:run_mode\[367] = \Base_Timer:TimerUDB:hwEnable\[368]
Removing Lhs of wire \Base_Timer:TimerUDB:run_mode\[367] = \Base_Timer:TimerUDB:control_7\[347]
Removing Lhs of wire \Base_Timer:TimerUDB:trigger_enable\[370] = one[216]
Removing Lhs of wire \Base_Timer:TimerUDB:tc_i\[372] = \Base_Timer:TimerUDB:status_tc\[369]
Removing Rhs of wire Net_6[375] = \Base_Timer:TimerUDB:tc_reg_i\[373]
Removing Lhs of wire \Base_Timer:TimerUDB:capt_fifo_load_int\[378] = \Base_Timer:TimerUDB:capt_fifo_load\[365]
Removing Lhs of wire \Base_Timer:TimerUDB:status_6\[381] = zero[212]
Removing Lhs of wire \Base_Timer:TimerUDB:status_5\[382] = zero[212]
Removing Lhs of wire \Base_Timer:TimerUDB:status_4\[383] = zero[212]
Removing Lhs of wire \Base_Timer:TimerUDB:status_0\[384] = \Base_Timer:TimerUDB:status_tc\[369]
Removing Lhs of wire \Base_Timer:TimerUDB:status_1\[385] = \Base_Timer:TimerUDB:capt_fifo_load\[365]
Removing Rhs of wire \Base_Timer:TimerUDB:status_2\[386] = \Base_Timer:TimerUDB:fifo_full\[387]
Removing Rhs of wire \Base_Timer:TimerUDB:status_3\[388] = \Base_Timer:TimerUDB:fifo_nempty\[389]
Removing Lhs of wire \Base_Timer:TimerUDB:cs_addr_2\[392] = zero[212]
Removing Lhs of wire \Base_Timer:TimerUDB:cs_addr_1\[393] = \Base_Timer:TimerUDB:trig_reg\[380]
Removing Lhs of wire \Base_Timer:TimerUDB:cs_addr_0\[394] = \Base_Timer:TimerUDB:per_zero\[371]
Removing Lhs of wire \Base_Timer:TimerUDB:capture_last\\D\[476] = zero[212]
Removing Lhs of wire \Base_Timer:TimerUDB:tc_reg_i\\D\[477] = \Base_Timer:TimerUDB:status_tc\[369]
Removing Lhs of wire \Base_Timer:TimerUDB:hwEnable_reg\\D\[478] = \Base_Timer:TimerUDB:control_7\[347]
Removing Lhs of wire \Base_Timer:TimerUDB:capture_out_reg_i\\D\[479] = \Base_Timer:TimerUDB:capt_fifo_load\[365]

------------------------------------------------------
Aliased 0 equations, 53 wires.
------------------------------------------------------

----------------------------------------------------------
Circuit simplification
----------------------------------------------------------

Substituting virtuals - pass 1:

Note:  Expanding virtual equation for 'zero' (cost = 0):
zero <=  ('0') ;

Note:  Expanding virtual equation for 'one' (cost = 0):
one <=  ('1') ;

Note:  Expanding virtual equation for '\Base_Timer:TimerUDB:fifo_load_polarized\' (cost = 0):
\Base_Timer:TimerUDB:fifo_load_polarized\ <=  ('0') ;

Note:  Expanding virtual equation for '\Base_Timer:TimerUDB:timer_enable\' (cost = 0):
\Base_Timer:TimerUDB:timer_enable\ <= (\Base_Timer:TimerUDB:control_7\);


Substituting virtuals - pass 2:


----------------------------------------------------------
Circuit simplification results:

	Expanded 4 signals.
	Turned 0 signals into soft nodes.
	Maximum default expansion cost was set at 3.
----------------------------------------------------------

------------------------------------------------------
Alias Detection
------------------------------------------------------
Aliasing \Base_Timer:TimerUDB:capt_fifo_load\ to zero
Removing Lhs of wire \Base_Timer:TimerUDB:capt_fifo_load\[365] = zero[212]
Removing Lhs of wire \Base_Timer:TimerUDB:trig_reg\[380] = \Base_Timer:TimerUDB:control_7\[347]

------------------------------------------------------
Aliased 0 equations, 2 wires.
------------------------------------------------------

----------------------------------------------------------
Circuit simplification
----------------------------------------------------------

Eliminating unused logic - pass 1:


Eliminating unused logic - pass 2:


Substituting virtuals - pass 1:


----------------------------------------------------------
Circuit simplification results:

	Expanded 0 signals.
	Turned 0 signals into soft nodes.
	Maximum default expansion cost was set at 3.
----------------------------------------------------------

topld:  No errors.

CYPRESS_DIR    : C:\Program Files (x86)\Cypress\PSoC Creator\4.4\PSoC Creator\warp
Warp Program   : C:\Program Files (x86)\Cypress\PSoC Creator\4.4\PSoC Creator\warp\bin\warp.exe
Warp Arguments : -yv2 -q10 -ygs -o2 -v3 -.fftcfgtype=LE -ya "-.fftprj=C:\METI\Firmware Varun\055 Smart Gloves\Smart Gloves\Smart_gloves_uinsg_mux.cydsn\Smart_gloves_uinsg_mux.cyprj" -dcpsoc3 Smart_gloves_uinsg_mux.v -verilog
</CYPRESSTAG>
Warp synthesis phase: Elapsed time ==> 1s.617ms
<CYPRESSTAG name="Fitter results...">
<CYPRESSTAG name="Fitter startup details...">
cyp3fit: V4.4.0.80, Family: PSoC3, Started at: Sunday, 17 April 2022 22:32:04
Options: -yv2 -q10 -ygs -o2 -v3 -.fftcfgtype=LE -ya -.fftprj=C:\METI\Firmware Varun\055 Smart Gloves\Smart Gloves\Smart_gloves_uinsg_mux.cydsn\Smart_gloves_uinsg_mux.cyprj -d CY8C4245PVI-482 Smart_gloves_uinsg_mux.v -verilog
</CYPRESSTAG>
<CYPRESSTAG name="Design parsing">
Design parsing phase: Elapsed time ==> 0s.031ms
</CYPRESSTAG>
<CYPRESSTAG name="Tech Mapping">
<CYPRESSTAG name="Initial Mapping" icon="FILE_RPT_TECHM">
    Converted constant MacroCell: \Base_Timer:TimerUDB:capture_last\ from registered to combinatorial
    Converted constant MacroCell: \Base_Timer:TimerUDB:capture_out_reg_i\ from registered to combinatorial

Removing unused cells resulting from optimization
Done removing unused cells.
<CYPRESSTAG name="Global Clock Selection" icon="FILE_RPT_TECHM">
    Digital Clock 0: Automatic-assigning  clock 'timer_clock'. Fanout=2, Signal=Net_10_digital
    Fixed Function Clock 2: Automatic-assigning  clock 'EZI2C_Flex_SCBCLK'. Signal=\EZI2C_Flex:Net_847_ff2\
    Fixed Function Clock 7: Automatic-assigning  clock 'ADC_Flex_intClock'. Signal=\ADC_Flex:Net_1845_ff7\
<CYPRESSTAG name="UDB Clock/Enable Remapping Results">
    UDB Clk/Enable \Base_Timer:TimerUDB:clock_enable_block\: with output requested to be synchronous
        ClockIn: ClockGenBlock:m0s8clockgenblockcell.gen_clk_out_0 was determined to be a global clock that is synchronous to HFClk
        EnableIn: Constant 1 was determined to be synchronous to ClockIn
        ClockOut: ClockGenBlock:m0s8clockgenblockcell.gen_clk_out_0, EnableOut: Constant 1
    UDB Clk/Enable \Base_Timer:TimerUDB:sCTRLReg:SyncCtl:cy_psoc3_udb_Ctl_Clk_Sync\: with output requested to be synchronous
        ClockIn: ClockGenBlock:m0s8clockgenblockcell.gen_clk_out_0 was determined to be a global clock that is synchronous to HFClk
        EnableIn: Constant 1 was determined to be synchronous to ClockIn
        ClockOut: ClockGenBlock:m0s8clockgenblockcell.gen_clk_out_0, EnableOut: Constant 1
</CYPRESSTAG>
</CYPRESSTAG>

Removing unused cells resulting from optimization
Done removing unused cells.

Removing unused cells resulting from optimization
Done removing unused cells.
<CYPRESSTAG name="Duplicate Macrocell detection">
</CYPRESSTAG>
</CYPRESSTAG>
<CYPRESSTAG name="Duplicate Macrocell detection">
</CYPRESSTAG>
<CYPRESSTAG name="Design Equations" icon="FILE_RPT_EQUATION">

------------------------------------------------------------
Design Equations
------------------------------------------------------------
    <CYPRESSTAG name="Pin listing">

    ------------------------------------------------------------
    Pin listing
    ------------------------------------------------------------

    Pin : Name = \UART:tx(0)\
        Attributes:
            In Group/Port: True
            In Sync Option: AUTO
            Out Sync Option: NOSYNC
            Interrupt generated: False
            Interrupt mode: NONE
            Drive mode: CMOS_OUT
            VTrip: EITHER
            Slew: FAST
            Input Sync needed: False
            Output Sync needed: False
            SC shield enabled: False
            POR State: ANY
            LCD Mode: COMMON
            Register Mode: RegComb
            CaSense Mode: NEITHER
            Treat as pin: True
            Is OE Registered: False
            Uses Analog: False
            Can contain Digital: True
            Is SIO: False
            SIO Output Buf: NONREGULATED
            SIO Input Buf: SINGLE_ENDED
            SIO HiFreq: LOW
            SIO Hyst: DISABLED
            SIO Vtrip: MULTIPLIER_0_5
            SIO Multiplier Index: 0
            SIO RefSel: VCC_IO
            Required Capabilities: DIGITAL
            Initial Value: 1
            IO Voltage: 0
        PORT MAP (
            pa_out => \UART:tx(0)\__PA ,
            pad => \UART:tx(0)_PAD\ );
        Properties:
        {
        }

    Pin : Name = Flex8(0)
        Attributes:
            In Group/Port: True
            In Sync Option: AUTO
            Out Sync Option: AUTO
            Interrupt generated: False
            Interrupt mode: NONE
            Drive mode: HI_Z_ANALOG
            VTrip: EITHER
            Slew: FAST
            Input Sync needed: False
            Output Sync needed: False
            SC shield enabled: False
            POR State: ANY
            LCD Mode: COMMON
            Register Mode: RegComb
            CaSense Mode: NEITHER
            Treat as pin: True
            Is OE Registered: False
            Uses Analog: True
            Can contain Digital: False
            Is SIO: False
            SIO Output Buf: NONREGULATED
            SIO Input Buf: SINGLE_ENDED
            SIO HiFreq: LOW
            SIO Hyst: DISABLED
            SIO Vtrip: MULTIPLIER_0_5
            SIO Multiplier Index: 0
            SIO RefSel: VCC_IO
            Required Capabilities: ANALOG
            Initial Value: 1
            IO Voltage: 0
        PORT MAP (
            pa_out => Flex8(0)__PA ,
            analog_term => Net_634 ,
            pad => Flex8(0)_PAD );
        Properties:
        {
        }

    Pin : Name = Flex9(0)
        Attributes:
            In Group/Port: True
            In Sync Option: AUTO
            Out Sync Option: AUTO
            Interrupt generated: False
            Interrupt mode: NONE
            Drive mode: HI_Z_ANALOG
            VTrip: EITHER
            Slew: FAST
            Input Sync needed: False
            Output Sync needed: False
            SC shield enabled: False
            POR State: ANY
            LCD Mode: COMMON
            Register Mode: RegComb
            CaSense Mode: NEITHER
            Treat as pin: True
            Is OE Registered: False
            Uses Analog: True
            Can contain Digital: False
            Is SIO: False
            SIO Output Buf: NONREGULATED
            SIO Input Buf: SINGLE_ENDED
            SIO HiFreq: LOW
            SIO Hyst: DISABLED
            SIO Vtrip: MULTIPLIER_0_5
            SIO Multiplier Index: 0
            SIO RefSel: VCC_IO
            Required Capabilities: ANALOG
            Initial Value: 1
            IO Voltage: 0
        PORT MAP (
            pa_out => Flex9(0)__PA ,
            analog_term => Net_635 ,
            pad => Flex9(0)_PAD );
        Properties:
        {
        }

    Pin : Name = Flex10(0)
        Attributes:
            In Group/Port: True
            In Sync Option: AUTO
            Out Sync Option: AUTO
            Interrupt generated: False
            Interrupt mode: NONE
            Drive mode: HI_Z_ANALOG
            VTrip: EITHER
            Slew: FAST
            Input Sync needed: False
            Output Sync needed: False
            SC shield enabled: False
            POR State: ANY
            LCD Mode: COMMON
            Register Mode: RegComb
            CaSense Mode: NEITHER
            Treat as pin: True
            Is OE Registered: False
            Uses Analog: True
            Can contain Digital: False
            Is SIO: False
            SIO Output Buf: NONREGULATED
            SIO Input Buf: SINGLE_ENDED
            SIO HiFreq: LOW
            SIO Hyst: DISABLED
            SIO Vtrip: MULTIPLIER_0_5
            SIO Multiplier Index: 0
            SIO RefSel: VCC_IO
            Required Capabilities: ANALOG
            Initial Value: 1
            IO Voltage: 0
        PORT MAP (
            pa_out => Flex10(0)__PA ,
            analog_term => Net_636 ,
            pad => Flex10(0)_PAD );
        Properties:
        {
        }

    Pin : Name = \EZI2C_Flex:sda(0)\
        Attributes:
            In Group/Port: True
            In Sync Option: NOSYNC
            Out Sync Option: NOSYNC
            Interrupt generated: False
            Interrupt mode: NONE
            Drive mode: OPEN_DRAIN_LO
            VTrip: CMOS
            Slew: FAST
            Input Sync needed: False
            Output Sync needed: False
            SC shield enabled: False
            POR State: ANY
            LCD Mode: COMMON
            Register Mode: RegComb
            CaSense Mode: NEITHER
            Treat as pin: True
            Is OE Registered: False
            Uses Analog: False
            Can contain Digital: True
            Is SIO: False
            SIO Output Buf: NONREGULATED
            SIO Input Buf: SINGLE_ENDED
            SIO HiFreq: LOW
            SIO Hyst: DISABLED
            SIO Vtrip: MULTIPLIER_0_5
            SIO Multiplier Index: 0
            SIO RefSel: VCC_IO
            Required Capabilities: DIGITAL
            Initial Value: 1
            IO Voltage: 0
        PORT MAP (
            pa_out => \EZI2C_Flex:sda(0)\__PA ,
            fb => Net_623 ,
            pad => \EZI2C_Flex:sda(0)_PAD\ );
        Properties:
        {
        }

    Pin : Name = \EZI2C_Flex:scl(0)\
        Attributes:
            In Group/Port: True
            In Sync Option: NOSYNC
            Out Sync Option: NOSYNC
            Interrupt generated: False
            Interrupt mode: NONE
            Drive mode: OPEN_DRAIN_LO
            VTrip: CMOS
            Slew: FAST
            Input Sync needed: False
            Output Sync needed: False
            SC shield enabled: False
            POR State: ANY
            LCD Mode: COMMON
            Register Mode: RegComb
            CaSense Mode: NEITHER
            Treat as pin: True
            Is OE Registered: False
            Uses Analog: False
            Can contain Digital: True
            Is SIO: False
            SIO Output Buf: NONREGULATED
            SIO Input Buf: SINGLE_ENDED
            SIO HiFreq: LOW
            SIO Hyst: DISABLED
            SIO Vtrip: MULTIPLIER_0_5
            SIO Multiplier Index: 0
            SIO RefSel: VCC_IO
            Required Capabilities: DIGITAL
            Initial Value: 1
            IO Voltage: 0
        PORT MAP (
            pa_out => \EZI2C_Flex:scl(0)\__PA ,
            fb => Net_622 ,
            pad => \EZI2C_Flex:scl(0)_PAD\ );
        Properties:
        {
        }

    Pin : Name = Flex1(0)
        Attributes:
            In Group/Port: True
            In Sync Option: AUTO
            Out Sync Option: AUTO
            Interrupt generated: False
            Interrupt mode: NONE
            Drive mode: HI_Z_ANALOG
            VTrip: EITHER
            Slew: FAST
            Input Sync needed: False
            Output Sync needed: False
            SC shield enabled: False
            POR State: ANY
            LCD Mode: COMMON
            Register Mode: RegComb
            CaSense Mode: NEITHER
            Treat as pin: True
            Is OE Registered: False
            Uses Analog: True
            Can contain Digital: False
            Is SIO: False
            SIO Output Buf: NONREGULATED
            SIO Input Buf: SINGLE_ENDED
            SIO HiFreq: LOW
            SIO Hyst: DISABLED
            SIO Vtrip: MULTIPLIER_0_5
            SIO Multiplier Index: 0
            SIO RefSel: VCC_IO
            Required Capabilities: ANALOG
            Initial Value: 1
            IO Voltage: 0
        PORT MAP (
            pa_out => Flex1(0)__PA ,
            analog_term => Net_626 ,
            pad => Flex1(0)_PAD );
        Properties:
        {
        }

    Pin : Name = Flex2(0)
        Attributes:
            In Group/Port: True
            In Sync Option: AUTO
            Out Sync Option: AUTO
            Interrupt generated: False
            Interrupt mode: NONE
            Drive mode: HI_Z_ANALOG
            VTrip: EITHER
            Slew: FAST
            Input Sync needed: False
            Output Sync needed: False
            SC shield enabled: False
            POR State: ANY
            LCD Mode: COMMON
            Register Mode: RegComb
            CaSense Mode: NEITHER
            Treat as pin: True
            Is OE Registered: False
            Uses Analog: True
            Can contain Digital: False
            Is SIO: False
            SIO Output Buf: NONREGULATED
            SIO Input Buf: SINGLE_ENDED
            SIO HiFreq: LOW
            SIO Hyst: DISABLED
            SIO Vtrip: MULTIPLIER_0_5
            SIO Multiplier Index: 0
            SIO RefSel: VCC_IO
            Required Capabilities: ANALOG
            Initial Value: 1
            IO Voltage: 0
        PORT MAP (
            pa_out => Flex2(0)__PA ,
            analog_term => Net_627 ,
            pad => Flex2(0)_PAD );
        Properties:
        {
        }

    Pin : Name = Flex3(0)
        Attributes:
            In Group/Port: True
            In Sync Option: AUTO
            Out Sync Option: AUTO
            Interrupt generated: False
            Interrupt mode: NONE
            Drive mode: HI_Z_ANALOG
            VTrip: EITHER
            Slew: FAST
            Input Sync needed: False
            Output Sync needed: False
            SC shield enabled: False
            POR State: ANY
            LCD Mode: COMMON
            Register Mode: RegComb
            CaSense Mode: NEITHER
            Treat as pin: True
            Is OE Registered: False
            Uses Analog: True
            Can contain Digital: False
            Is SIO: False
            SIO Output Buf: NONREGULATED
            SIO Input Buf: SINGLE_ENDED
            SIO HiFreq: LOW
            SIO Hyst: DISABLED
            SIO Vtrip: MULTIPLIER_0_5
            SIO Multiplier Index: 0
            SIO RefSel: VCC_IO
            Required Capabilities: ANALOG
            Initial Value: 1
            IO Voltage: 0
        PORT MAP (
            pa_out => Flex3(0)__PA ,
            analog_term => Net_628 ,
            pad => Flex3(0)_PAD );
        Properties:
        {
        }

    Pin : Name = Flex4(0)
        Attributes:
            In Group/Port: True
            In Sync Option: AUTO
            Out Sync Option: AUTO
            Interrupt generated: False
            Interrupt mode: NONE
            Drive mode: HI_Z_ANALOG
            VTrip: EITHER
            Slew: FAST
            Input Sync needed: False
            Output Sync needed: False
            SC shield enabled: False
            POR State: ANY
            LCD Mode: COMMON
            Register Mode: RegComb
            CaSense Mode: NEITHER
            Treat as pin: True
            Is OE Registered: False
            Uses Analog: True
            Can contain Digital: False
            Is SIO: False
            SIO Output Buf: NONREGULATED
            SIO Input Buf: SINGLE_ENDED
            SIO HiFreq: LOW
            SIO Hyst: DISABLED
            SIO Vtrip: MULTIPLIER_0_5
            SIO Multiplier Index: 0
            SIO RefSel: VCC_IO
            Required Capabilities: ANALOG
            Initial Value: 1
            IO Voltage: 0
        PORT MAP (
            pa_out => Flex4(0)__PA ,
            analog_term => Net_629 ,
            pad => Flex4(0)_PAD );
        Properties:
        {
        }

    Pin : Name = Flex5(0)
        Attributes:
            In Group/Port: True
            In Sync Option: AUTO
            Out Sync Option: AUTO
            Interrupt generated: False
            Interrupt mode: NONE
            Drive mode: HI_Z_ANALOG
            VTrip: EITHER
            Slew: FAST
            Input Sync needed: False
            Output Sync needed: False
            SC shield enabled: False
            POR State: ANY
            LCD Mode: COMMON
            Register Mode: RegComb
            CaSense Mode: NEITHER
            Treat as pin: True
            Is OE Registered: False
            Uses Analog: True
            Can contain Digital: False
            Is SIO: False
            SIO Output Buf: NONREGULATED
            SIO Input Buf: SINGLE_ENDED
            SIO HiFreq: LOW
            SIO Hyst: DISABLED
            SIO Vtrip: MULTIPLIER_0_5
            SIO Multiplier Index: 0
            SIO RefSel: VCC_IO
            Required Capabilities: ANALOG
            Initial Value: 1
            IO Voltage: 0
        PORT MAP (
            pa_out => Flex5(0)__PA ,
            analog_term => Net_631 ,
            pad => Flex5(0)_PAD );
        Properties:
        {
        }

    Pin : Name = Flex6(0)
        Attributes:
            In Group/Port: True
            In Sync Option: AUTO
            Out Sync Option: AUTO
            Interrupt generated: False
            Interrupt mode: NONE
            Drive mode: HI_Z_ANALOG
            VTrip: EITHER
            Slew: FAST
            Input Sync needed: False
            Output Sync needed: False
            SC shield enabled: False
            POR State: ANY
            LCD Mode: COMMON
            Register Mode: RegComb
            CaSense Mode: NEITHER
            Treat as pin: True
            Is OE Registered: False
            Uses Analog: True
            Can contain Digital: False
            Is SIO: False
            SIO Output Buf: NONREGULATED
            SIO Input Buf: SINGLE_ENDED
            SIO HiFreq: LOW
            SIO Hyst: DISABLED
            SIO Vtrip: MULTIPLIER_0_5
            SIO Multiplier Index: 0
            SIO RefSel: VCC_IO
            Required Capabilities: ANALOG
            Initial Value: 1
            IO Voltage: 0
        PORT MAP (
            pa_out => Flex6(0)__PA ,
            analog_term => Net_632 ,
            pad => Flex6(0)_PAD );
        Properties:
        {
        }

    Pin : Name = Flex7(0)
        Attributes:
            In Group/Port: True
            In Sync Option: AUTO
            Out Sync Option: AUTO
            Interrupt generated: False
            Interrupt mode: NONE
            Drive mode: HI_Z_ANALOG
            VTrip: EITHER
            Slew: FAST
            Input Sync needed: False
            Output Sync needed: False
            SC shield enabled: False
            POR State: ANY
            LCD Mode: COMMON
            Register Mode: RegComb
            CaSense Mode: NEITHER
            Treat as pin: True
            Is OE Registered: False
            Uses Analog: True
            Can contain Digital: False
            Is SIO: False
            SIO Output Buf: NONREGULATED
            SIO Input Buf: SINGLE_ENDED
            SIO HiFreq: LOW
            SIO Hyst: DISABLED
            SIO Vtrip: MULTIPLIER_0_5
            SIO Multiplier Index: 0
            SIO RefSel: VCC_IO
            Required Capabilities: ANALOG
            Initial Value: 1
            IO Voltage: 0
        PORT MAP (
            pa_out => Flex7(0)__PA ,
            analog_term => Net_633 ,
            pad => Flex7(0)_PAD );
        Properties:
        {
        }
    </CYPRESSTAG>
    <CYPRESSTAG name="Macrocell listing" icon="FILE_RPT_EQUATION">

    ------------------------------------------------------------
    Macrocell listing
    ------------------------------------------------------------

    MacroCell: Name=\Base_Timer:TimerUDB:status_tc\, Mode=(Combinatorial)
        Total # of inputs        : 2
        Total # of product terms : 1
            Clock Enable: True
        Main Equation            : 1 pterm
        (
              \Base_Timer:TimerUDB:control_7\ * 
              \Base_Timer:TimerUDB:per_zero\
        );
        Output = \Base_Timer:TimerUDB:status_tc\ (fanout=1)

    MacroCell: Name=Net_6, Mode=(D-Register)
        Total # of inputs        : 2
        Total # of product terms : 1
        List of special equations: 
            Clock  = (Net_10_digital) => Global
            Clock Enable: True
        Main Equation            : 1 pterm
        (
              \Base_Timer:TimerUDB:control_7\ * 
              \Base_Timer:TimerUDB:per_zero\
        );
        Output = Net_6 (fanout=1)
    </CYPRESSTAG>
    <CYPRESSTAG name="Datapath listing">

    ------------------------------------------------------------
    Datapath listing
    ------------------------------------------------------------

    datapathcell: Name =\Base_Timer:TimerUDB:sT16:timerdp:u0\
        PORT MAP (
            clock => Net_10_digital ,
            cs_addr_1 => \Base_Timer:TimerUDB:control_7\ ,
            cs_addr_0 => \Base_Timer:TimerUDB:per_zero\ ,
            chain_out => \Base_Timer:TimerUDB:sT16:timerdp:carry\ );
        Properties:
        {
            a0_init = "00000000"
            a1_init = "00000000"
            ce0_sync = 1
            ce1_sync = 1
            cl0_sync = 1
            cl1_sync = 1
            cmsb_sync = 1
            co_msb_sync = 1
            cy_dpconfig = "0000000001000000000000000100000001000000010000000000000010000000000000001000000000000000100000000000000010000000000000001000000011111111000000001111111111111111000000000000000000000001000000000000000000011000"
            d0_init = "00000000"
            d1_init = "00000000"
            f0_blk_sync = 1
            f0_bus_sync = 1
            f1_blk_sync = 1
            f1_bus_sync = 1
            ff0_sync = 1
            ff1_sync = 1
            ov_msb_sync = 1
            so_sync = 1
            z0_sync = 1
            z1_sync = 1
        }
        Clock Polarity: Active High
        Clock Enable: True
        Next in chain : \Base_Timer:TimerUDB:sT16:timerdp:u1\

    datapathcell: Name =\Base_Timer:TimerUDB:sT16:timerdp:u1\
        PORT MAP (
            clock => Net_10_digital ,
            cs_addr_1 => \Base_Timer:TimerUDB:control_7\ ,
            cs_addr_0 => \Base_Timer:TimerUDB:per_zero\ ,
            z0_comb => \Base_Timer:TimerUDB:per_zero\ ,
            f0_bus_stat_comb => \Base_Timer:TimerUDB:status_3\ ,
            f0_blk_stat_comb => \Base_Timer:TimerUDB:status_2\ ,
            chain_in => \Base_Timer:TimerUDB:sT16:timerdp:carry\ );
        Properties:
        {
            a0_init = "00000000"
            a1_init = "00000000"
            ce0_sync = 1
            ce1_sync = 1
            cl0_sync = 1
            cl1_sync = 1
            cmsb_sync = 1
            co_msb_sync = 1
            cy_dpconfig = "0000000001000000000000000100000001000000010000000000000010000000000000001000000000000000100000000000000010000000000000001000000011111111000000001111111111111111100000110000000000000001000000110000000000011000"
            d0_init = "00000000"
            d1_init = "00000000"
            f0_blk_sync = 1
            f0_bus_sync = 1
            f1_blk_sync = 1
            f1_bus_sync = 1
            ff0_sync = 1
            ff1_sync = 1
            ov_msb_sync = 1
            so_sync = 1
            z0_sync = 1
            z1_sync = 1
        }
        Clock Polarity: Active High
        Clock Enable: True
        Previous in chain : \Base_Timer:TimerUDB:sT16:timerdp:u0\
    </CYPRESSTAG>
    <CYPRESSTAG name="Status register listing">
    </CYPRESSTAG>
    <CYPRESSTAG name="StatusI register listing">

    ------------------------------------------------------------
    StatusI register listing
    ------------------------------------------------------------

    statusicell: Name =\Base_Timer:TimerUDB:rstSts:stsreg\
        PORT MAP (
            clock => Net_10_digital ,
            status_3 => \Base_Timer:TimerUDB:status_3\ ,
            status_2 => \Base_Timer:TimerUDB:status_2\ ,
            status_0 => \Base_Timer:TimerUDB:status_tc\ );
        Properties:
        {
            cy_force_order = 1
            cy_int_mask = "1111111"
            cy_md_select = "0000011"
        }
        Clock Polarity: Active High
        Clock Enable: True
    </CYPRESSTAG>
    <CYPRESSTAG name="Sync listing">
    </CYPRESSTAG>
    <CYPRESSTAG name="Control register listing">

    ------------------------------------------------------------
    Control register listing
    ------------------------------------------------------------

    controlcell: Name =\Base_Timer:TimerUDB:sCTRLReg:SyncCtl:ctrlreg\
        PORT MAP (
            clock => Net_10_digital ,
            control_7 => \Base_Timer:TimerUDB:control_7\ ,
            control_6 => \Base_Timer:TimerUDB:control_6\ ,
            control_5 => \Base_Timer:TimerUDB:control_5\ ,
            control_4 => \Base_Timer:TimerUDB:control_4\ ,
            control_3 => \Base_Timer:TimerUDB:control_3\ ,
            control_2 => \Base_Timer:TimerUDB:control_2\ ,
            control_1 => \Base_Timer:TimerUDB:control_1\ ,
            control_0 => \Base_Timer:TimerUDB:control_0\ );
        Properties:
        {
            cy_ctrl_mode_0 = "11111111"
            cy_ctrl_mode_1 = "00000000"
            cy_ext_reset = 0
            cy_force_order = 1
            cy_init_value = "00000000"
        }
        Clock Polarity: Active High
        Clock Enable: True
    </CYPRESSTAG>
    <CYPRESSTAG name="Count7 listing">
    </CYPRESSTAG>
    <CYPRESSTAG name="DRQ listing">
    </CYPRESSTAG>
    <CYPRESSTAG name="Interrupt listing">

    ------------------------------------------------------------
    Interrupt listing
    ------------------------------------------------------------

    interrupt: Name =\ADC_Flex:IRQ\
        PORT MAP (
            interrupt => \ADC_Flex:Net_3112\ );
        Properties:
        {
            int_type = "10"
            is_nmi = 0
        }

    interrupt: Name =\EZI2C_Flex:SCB_IRQ\
        PORT MAP (
            interrupt => Net_606 );
        Properties:
        {
            int_type = "10"
            is_nmi = 0
        }

    interrupt: Name =isr_1ms
        PORT MAP (
            interrupt => Net_6 );
        Properties:
        {
            int_type = "00"
            is_nmi = 0
        }
    </CYPRESSTAG>
</CYPRESSTAG>
<CYPRESSTAG name="Technology mapping summary" expanded>

------------------------------------------------------------
Technology mapping summary
------------------------------------------------------------

Resource Type                 : Used : Free :  Max :  % Used
============================================================
Digital Clocks                :    1 :    3 :    4 : 25.00 %
Interrupts                    :    3 :   29 :   32 :  9.38 %
IO                            :   15 :    9 :   24 : 62.50 %
Segment LCD                   :    0 :    1 :    1 :  0.00 %
CapSense                      :    0 :    1 :    1 :  0.00 %
Die Temp                      :    0 :    1 :    1 :  0.00 %
Serial Communication (SCB)    :    1 :    1 :    2 : 50.00 %
Timer/Counter/PWM             :    0 :    4 :    4 :  0.00 %
UDB                           :      :      :      :        
  Macrocells                  :    2 :   30 :   32 :  6.25 %
  Unique P-terms              :    1 :   63 :   64 :  1.56 %
  Total P-terms               :    2 :      :      :        
  Datapath Cells              :    2 :    2 :    4 : 50.00 %
  Status Cells                :    1 :    3 :    4 : 25.00 %
    StatusI Registers         :    1 :      :      :        
  Control Cells               :    1 :    3 :    4 : 25.00 %
    Control Registers         :    1 :      :      :        
Comparator/Opamp              :    0 :    1 :    1 :  0.00 %
LP Comparator                 :    0 :    2 :    2 :  0.00 %
SAR ADC                       :    1 :    0 :    1 : 100.00 %
DAC                           :      :      :      :        
  7-bit IDAC                  :    0 :    1 :    1 :  0.00 %
  8-bit IDAC                  :    0 :    1 :    1 :  0.00 %
</CYPRESSTAG>
Technology Mapping: Elapsed time ==> 0s.180ms
Tech Mapping phase: Elapsed time ==> 0s.211ms
</CYPRESSTAG>
<CYPRESSTAG name="Analog Placement">
<CYPRESSTAG name="FFB & IO Pre Placement">
<CYPRESSTAG name="Placement" icon="FILE_RPT_PLACEMENT">

Cell                                : Block                              
=========================================================================
\UART:tx(0)\                        : [IOP=(3)][IoId=(1)]                
Flex8(0)                            : [IOP=(1)][IoId=(2)]                
Flex9(0)                            : [IOP=(2)][IoId=(2)]                
Flex10(0)                           : [IOP=(2)][IoId=(3)]                
\EZI2C_Flex:sda(0)\                 : [IOP=(4)][IoId=(1)]                
\EZI2C_Flex:scl(0)\                 : [IOP=(4)][IoId=(0)]                
Flex1(0)                            : [IOP=(2)][IoId=(6)]                
Flex2(0)                            : [IOP=(2)][IoId=(7)]                
Flex3(0)                            : [IOP=(2)][IoId=(5)]                
Flex4(0)                            : [IOP=(2)][IoId=(4)]                
Flex5(0)                            : [IOP=(0)][IoId=(0)]                
Flex6(0)                            : [IOP=(1)][IoId=(1)]                
Flex7(0)                            : [IOP=(0)][IoId=(1)]                
ClockGenBlock                       : CLK_GEN_[FFB(CLK_GEN,0)]           
\ADC_Flex:cy_psoc4_sar\             : SARADC_[FFB(SARADC,0)]             
\EZI2C_Flex:SCB\                    : SCB_[FFB(SCB,0)]                   

</CYPRESSTAG>
</CYPRESSTAG>
<CYPRESSTAG name="Real Analog Placement">
Elapsed time ==> 0.1414433s
</CYPRESSTAG>
Analog Placement phase: Elapsed time ==> 0s.374ms
</CYPRESSTAG>
<CYPRESSTAG name="Analog Routing">
<CYPRESSTAG name="Analog Routing">
Route success=True, Iterations=1 Elapsed=0.0271430 secs
</CYPRESSTAG>
Analog Routing phase: Elapsed time ==> 0s.046ms
</CYPRESSTAG>
<CYPRESSTAG name="Analog Code Generation">
============ Analog Final Answer Routes ============
Dump of CyAnalogRoutingResultsDB
Map of net to items {
  Net: Net_626 {
    p2_6
  }
  Net: Net_627 {
    p2_7
  }
  Net: Net_628 {
    p2_5
  }
  Net: Net_629 {
    p2_4
  }
  Net: Net_631 {
    p0_0
  }
  Net: Net_632 {
    p1_1
  }
  Net: Net_633 {
    p0_1
  }
  Net: Net_634 {
    p1_2
  }
  Net: Net_635 {
    p2_2
  }
  Net: Net_636 {
    p2_3
  }
  Net: \ADC_Flex:Net_3113\ {
  }
  Net: \ADC_Flex:mux_bus_minus_0\ {
  }
  Net: \ADC_Flex:mux_bus_minus_1\ {
  }
  Net: \ADC_Flex:mux_bus_plus_1\ {
  }
  Net: Net_598 {
    sarmux_vplus
  }
  Net: AMuxNet::Flex_Mux {
    SARMUX0_sw6
    SARMUX0_sw7
    SARMUX0_sw5
    SARMUX0_sw4
    SARMUX0_sw18
    amuxbusa
    P0_P40
    P1_P41
    P0_P41
    P1_P42
    SARMUX0_sw2
    SARMUX0_sw3
  }
}
Map of item to net {
  p2_6                                             -> Net_626
  p2_7                                             -> Net_627
  p2_5                                             -> Net_628
  p2_4                                             -> Net_629
  p0_0                                             -> Net_631
  p1_1                                             -> Net_632
  p0_1                                             -> Net_633
  p1_2                                             -> Net_634
  p2_2                                             -> Net_635
  p2_3                                             -> Net_636
  sarmux_vplus                                     -> Net_598
  SARMUX0_sw6                                      -> AMuxNet::Flex_Mux
  SARMUX0_sw7                                      -> AMuxNet::Flex_Mux
  SARMUX0_sw5                                      -> AMuxNet::Flex_Mux
  SARMUX0_sw4                                      -> AMuxNet::Flex_Mux
  SARMUX0_sw18                                     -> AMuxNet::Flex_Mux
  amuxbusa                                         -> AMuxNet::Flex_Mux
  P0_P40                                           -> AMuxNet::Flex_Mux
  P1_P41                                           -> AMuxNet::Flex_Mux
  P0_P41                                           -> AMuxNet::Flex_Mux
  P1_P42                                           -> AMuxNet::Flex_Mux
  SARMUX0_sw2                                      -> AMuxNet::Flex_Mux
  SARMUX0_sw3                                      -> AMuxNet::Flex_Mux
}
Mux Info {
  Mux: Flex_Mux {
     Mouth: Net_598
     Guts:  AMuxNet::Flex_Mux
     IsSingleSwitching: True
     IsStaticSwitching: False
     IsAtMostOneSwitch: False
    Arm: 0 {
      Net:   Net_626
      Outer: SARMUX0_sw6
      Inner: __open__
      Path {
        SARMUX0_sw6
        p2_6
      }
    }
    Arm: 1 {
      Net:   Net_627
      Outer: SARMUX0_sw7
      Inner: __open__
      Path {
        SARMUX0_sw7
        p2_7
      }
    }
    Arm: 2 {
      Net:   Net_628
      Outer: SARMUX0_sw5
      Inner: __open__
      Path {
        SARMUX0_sw5
        p2_5
      }
    }
    Arm: 3 {
      Net:   Net_629
      Outer: SARMUX0_sw4
      Inner: __open__
      Path {
        SARMUX0_sw4
        p2_4
      }
    }
    Arm: 4 {
      Net:   Net_631
      Outer: P0_P40
      Inner: __open__
      Path {
        SARMUX0_sw18
        amuxbusa
        P0_P40
        p0_0
      }
    }
    Arm: 5 {
      Net:   Net_632
      Outer: P1_P41
      Inner: __open__
      Path {
        SARMUX0_sw18
        amuxbusa
        P1_P41
        p1_1
      }
    }
    Arm: 6 {
      Net:   Net_633
      Outer: P0_P41
      Inner: __open__
      Path {
        SARMUX0_sw18
        amuxbusa
        P0_P41
        p0_1
      }
    }
    Arm: 7 {
      Net:   Net_634
      Outer: P1_P42
      Inner: __open__
      Path {
        SARMUX0_sw18
        amuxbusa
        P1_P42
        p1_2
      }
    }
    Arm: 8 {
      Net:   Net_635
      Outer: SARMUX0_sw2
      Inner: __open__
      Path {
        SARMUX0_sw2
        p2_2
      }
    }
    Arm: 9 {
      Net:   Net_636
      Outer: SARMUX0_sw3
      Inner: __open__
      Path {
        SARMUX0_sw3
        p2_3
      }
    }
  }
}
Analog Code Generation phase: Elapsed time ==> 0s.031ms
</CYPRESSTAG>
<CYPRESSTAG name="Digital Placement">
<CYPRESSTAG name="Detailed placement messages">
I2076: Total run-time: 0.7 sec.

</CYPRESSTAG>
<CYPRESSTAG name="PLD Packing">
<CYPRESSTAG name="PLD Packing Summary" expanded>

------------------------------------------------------------
PLD Packing Summary
------------------------------------------------------------
            Resource Type : Used : Free :  Max :  % Used
    ====================================================
                     PLDs :    2 :    6 :    8 :  25.00%

<CYPRESSTAG name="PLD Statistics">

        PLD Resource Type :     Average/LAB
    =======================================
                   Inputs :            1.00
                   Pterms :            1.00
               Macrocells :            1.50
</CYPRESSTAG>
<CYPRESSTAG name="Packed PLD Contents">
Packed PLD Contents not displayed at this verbose level.</CYPRESSTAG>
</CYPRESSTAG>
PLD Packing: Elapsed time ==> 0s.000ms
</CYPRESSTAG>
<CYPRESSTAG name="Partitioning">
<CYPRESSTAG name="Initial Partitioning Summary">
Initial Partitioning Summary not displayed at this verbose level.</CYPRESSTAG>
<CYPRESSTAG name="Final Partitioning Summary">
Final Partitioning Summary not displayed at this verbose level.</CYPRESSTAG>
Partitioning: Elapsed time ==> 0s.015ms
</CYPRESSTAG>
<CYPRESSTAG name="Final Placement Summary">

------------------------------------------------------------
Final Placement Summary
------------------------------------------------------------

       Resource Type :      Count : Avg Inputs : Avg Outputs
    ========================================================
                 UDB :          3 :       0.67 :       1.00
<CYPRESSTAG name="Final Placement Details">
<CYPRESSTAG name="Component Details">

------------------------------------------------------------
Component Placement Details
------------------------------------------------------------
UDB [UDB=(0,0)] contents:
LAB@[UDB=(0,0)][LB=0] #macrocells=2, #inputs=2, #pterms=1
{
    [McSlotId=0]:     MacroCell: Name=Net_6, Mode=(D-Register) @ [UDB=(0,0)][LB=0][MC=0]
        Total # of inputs        : 2
        Total # of product terms : 1
        List of special equations: 
            Clock  = (Net_10_digital) => Global
            Clock Enable: True
        Main Equation            : 1 pterm
        (
              \Base_Timer:TimerUDB:control_7\ * 
              \Base_Timer:TimerUDB:per_zero\
        );
        Output = Net_6 (fanout=1)
        Properties               : 
        {
        }

    [McSlotId=1]:     MacroCell: Name=\Base_Timer:TimerUDB:status_tc\, Mode=(Combinatorial) @ [UDB=(0,0)][LB=0][MC=1]
        Total # of inputs        : 2
        Total # of product terms : 1
            Clock Enable: True
        Main Equation            : 1 pterm
        (
              \Base_Timer:TimerUDB:control_7\ * 
              \Base_Timer:TimerUDB:per_zero\
        );
        Output = \Base_Timer:TimerUDB:status_tc\ (fanout=1)
        Properties               : 
        {
        }

    [McSlotId=2]: (empty)
    [McSlotId=3]: (empty)
}

datapathcell: Name =\Base_Timer:TimerUDB:sT16:timerdp:u1\
    PORT MAP (
        clock => Net_10_digital ,
        cs_addr_1 => \Base_Timer:TimerUDB:control_7\ ,
        cs_addr_0 => \Base_Timer:TimerUDB:per_zero\ ,
        z0_comb => \Base_Timer:TimerUDB:per_zero\ ,
        f0_bus_stat_comb => \Base_Timer:TimerUDB:status_3\ ,
        f0_blk_stat_comb => \Base_Timer:TimerUDB:status_2\ ,
        chain_in => \Base_Timer:TimerUDB:sT16:timerdp:carry\ );
    Properties:
    {
        a0_init = "00000000"
        a1_init = "00000000"
        ce0_sync = 1
        ce1_sync = 1
        cl0_sync = 1
        cl1_sync = 1
        cmsb_sync = 1
        co_msb_sync = 1
        cy_dpconfig = "0000000001000000000000000100000001000000010000000000000010000000000000001000000000000000100000000000000010000000000000001000000011111111000000001111111111111111100000110000000000000001000000110000000000011000"
        d0_init = "00000000"
        d1_init = "00000000"
        f0_blk_sync = 1
        f0_bus_sync = 1
        f1_blk_sync = 1
        f1_bus_sync = 1
        ff0_sync = 1
        ff1_sync = 1
        ov_msb_sync = 1
        so_sync = 1
        z0_sync = 1
        z1_sync = 1
    }
    Clock Polarity: Active High
    Clock Enable: True
    Previous in chain : \Base_Timer:TimerUDB:sT16:timerdp:u0\

statusicell: Name =\Base_Timer:TimerUDB:rstSts:stsreg\
    PORT MAP (
        clock => Net_10_digital ,
        status_3 => \Base_Timer:TimerUDB:status_3\ ,
        status_2 => \Base_Timer:TimerUDB:status_2\ ,
        status_0 => \Base_Timer:TimerUDB:status_tc\ );
    Properties:
    {
        cy_force_order = 1
        cy_int_mask = "1111111"
        cy_md_select = "0000011"
    }
    Clock Polarity: Active High
    Clock Enable: True

controlcell: Name =\Base_Timer:TimerUDB:sCTRLReg:SyncCtl:ctrlreg\
    PORT MAP (
        clock => Net_10_digital ,
        control_7 => \Base_Timer:TimerUDB:control_7\ ,
        control_6 => \Base_Timer:TimerUDB:control_6\ ,
        control_5 => \Base_Timer:TimerUDB:control_5\ ,
        control_4 => \Base_Timer:TimerUDB:control_4\ ,
        control_3 => \Base_Timer:TimerUDB:control_3\ ,
        control_2 => \Base_Timer:TimerUDB:control_2\ ,
        control_1 => \Base_Timer:TimerUDB:control_1\ ,
        control_0 => \Base_Timer:TimerUDB:control_0\ );
    Properties:
    {
        cy_ctrl_mode_0 = "11111111"
        cy_ctrl_mode_1 = "00000000"
        cy_ext_reset = 0
        cy_force_order = 1
        cy_init_value = "00000000"
    }
    Clock Polarity: Active High
    Clock Enable: True

UDB [UDB=(0,1)] is empty.
UDB [UDB=(1,0)] contents:
datapathcell: Name =\Base_Timer:TimerUDB:sT16:timerdp:u0\
    PORT MAP (
        clock => Net_10_digital ,
        cs_addr_1 => \Base_Timer:TimerUDB:control_7\ ,
        cs_addr_0 => \Base_Timer:TimerUDB:per_zero\ ,
        chain_out => \Base_Timer:TimerUDB:sT16:timerdp:carry\ );
    Properties:
    {
        a0_init = "00000000"
        a1_init = "00000000"
        ce0_sync = 1
        ce1_sync = 1
        cl0_sync = 1
        cl1_sync = 1
        cmsb_sync = 1
        co_msb_sync = 1
        cy_dpconfig = "0000000001000000000000000100000001000000010000000000000010000000000000001000000000000000100000000000000010000000000000001000000011111111000000001111111111111111000000000000000000000001000000000000000000011000"
        d0_init = "00000000"
        d1_init = "00000000"
        f0_blk_sync = 1
        f0_bus_sync = 1
        f1_blk_sync = 1
        f1_bus_sync = 1
        ff0_sync = 1
        ff1_sync = 1
        ov_msb_sync = 1
        so_sync = 1
        z0_sync = 1
        z1_sync = 1
    }
    Clock Polarity: Active High
    Clock Enable: True
    Next in chain : \Base_Timer:TimerUDB:sT16:timerdp:u1\

UDB [UDB=(1,1)] contents:
LAB@[UDB=(1,1)][LB=0] #macrocells=1, #inputs=0, #pterms=1
{
    [McSlotId=0]:     MacroCell: Name=__ONE__, Mode=(Combinatorial) @ [UDB=(1,1)][LB=0][MC=0]
        Total # of inputs        : 0
        Total # of product terms : 1
            Clock Enable: True
        Main Equation            : 1 pterm
        (
            1
        );
        Output = __ONE__ (fanout=4)
        Properties               : 
        {
        }

    [McSlotId=1]: (empty)
    [McSlotId=2]: (empty)
    [McSlotId=3]: (empty)
}

Intr container @ [IntrContainer=(0)]: 
  Intr@ [IntrContainer=(0)][IntrId=(0)] 
    interrupt: Name =isr_1ms
        PORT MAP (
            interrupt => Net_6 );
        Properties:
        {
            int_type = "00"
            is_nmi = 0
        }
  Intr@ [IntrContainer=(0)][IntrId=(10)] 
    interrupt: Name =\EZI2C_Flex:SCB_IRQ\
        PORT MAP (
            interrupt => Net_606 );
        Properties:
        {
            int_type = "10"
            is_nmi = 0
        }
  Intr@ [IntrContainer=(0)][IntrId=(14)] 
    interrupt: Name =\ADC_Flex:IRQ\
        PORT MAP (
            interrupt => \ADC_Flex:Net_3112\ );
        Properties:
        {
            int_type = "10"
            is_nmi = 0
        }
Port 0 contains the following IO cells:
[IoId=0]: 
Pin : Name = Flex5(0)
    Attributes:
        In Group/Port: True
        In Sync Option: AUTO
        Out Sync Option: AUTO
        Interrupt generated: False
        Interrupt mode: NONE
        Drive mode: HI_Z_ANALOG
        VTrip: EITHER
        Slew: FAST
        Input Sync needed: False
        Output Sync needed: False
        SC shield enabled: False
        POR State: ANY
        LCD Mode: COMMON
        Register Mode: RegComb
        CaSense Mode: NEITHER
        Treat as pin: True
        Is OE Registered: False
        Uses Analog: True
        Can contain Digital: False
        Is SIO: False
        SIO Output Buf: NONREGULATED
        SIO Input Buf: SINGLE_ENDED
        SIO HiFreq: LOW
        SIO Hyst: DISABLED
        SIO Vtrip: MULTIPLIER_0_5
        SIO Multiplier Index: 0
        SIO RefSel: VCC_IO
        Required Capabilities: ANALOG
        Initial Value: 1
        IO Voltage: 0
    PORT MAP (
        pa_out => Flex5(0)__PA ,
        analog_term => Net_631 ,
        pad => Flex5(0)_PAD ,
        pin_input => __ONE__ );
    Properties:
    {
    }

[IoId=1]: 
Pin : Name = Flex7(0)
    Attributes:
        In Group/Port: True
        In Sync Option: AUTO
        Out Sync Option: AUTO
        Interrupt generated: False
        Interrupt mode: NONE
        Drive mode: HI_Z_ANALOG
        VTrip: EITHER
        Slew: FAST
        Input Sync needed: False
        Output Sync needed: False
        SC shield enabled: False
        POR State: ANY
        LCD Mode: COMMON
        Register Mode: RegComb
        CaSense Mode: NEITHER
        Treat as pin: True
        Is OE Registered: False
        Uses Analog: True
        Can contain Digital: False
        Is SIO: False
        SIO Output Buf: NONREGULATED
        SIO Input Buf: SINGLE_ENDED
        SIO HiFreq: LOW
        SIO Hyst: DISABLED
        SIO Vtrip: MULTIPLIER_0_5
        SIO Multiplier Index: 0
        SIO RefSel: VCC_IO
        Required Capabilities: ANALOG
        Initial Value: 1
        IO Voltage: 0
    PORT MAP (
        pa_out => Flex7(0)__PA ,
        analog_term => Net_633 ,
        pad => Flex7(0)_PAD ,
        pin_input => __ONE__ );
    Properties:
    {
    }

Port 1 contains the following IO cells:
[IoId=1]: 
Pin : Name = Flex6(0)
    Attributes:
        In Group/Port: True
        In Sync Option: AUTO
        Out Sync Option: AUTO
        Interrupt generated: False
        Interrupt mode: NONE
        Drive mode: HI_Z_ANALOG
        VTrip: EITHER
        Slew: FAST
        Input Sync needed: False
        Output Sync needed: False
        SC shield enabled: False
        POR State: ANY
        LCD Mode: COMMON
        Register Mode: RegComb
        CaSense Mode: NEITHER
        Treat as pin: True
        Is OE Registered: False
        Uses Analog: True
        Can contain Digital: False
        Is SIO: False
        SIO Output Buf: NONREGULATED
        SIO Input Buf: SINGLE_ENDED
        SIO HiFreq: LOW
        SIO Hyst: DISABLED
        SIO Vtrip: MULTIPLIER_0_5
        SIO Multiplier Index: 0
        SIO RefSel: VCC_IO
        Required Capabilities: ANALOG
        Initial Value: 1
        IO Voltage: 0
    PORT MAP (
        pa_out => Flex6(0)__PA ,
        analog_term => Net_632 ,
        pad => Flex6(0)_PAD ,
        pin_input => __ONE__ );
    Properties:
    {
    }

[IoId=2]: 
Pin : Name = Flex8(0)
    Attributes:
        In Group/Port: True
        In Sync Option: AUTO
        Out Sync Option: AUTO
        Interrupt generated: False
        Interrupt mode: NONE
        Drive mode: HI_Z_ANALOG
        VTrip: EITHER
        Slew: FAST
        Input Sync needed: False
        Output Sync needed: False
        SC shield enabled: False
        POR State: ANY
        LCD Mode: COMMON
        Register Mode: RegComb
        CaSense Mode: NEITHER
        Treat as pin: True
        Is OE Registered: False
        Uses Analog: True
        Can contain Digital: False
        Is SIO: False
        SIO Output Buf: NONREGULATED
        SIO Input Buf: SINGLE_ENDED
        SIO HiFreq: LOW
        SIO Hyst: DISABLED
        SIO Vtrip: MULTIPLIER_0_5
        SIO Multiplier Index: 0
        SIO RefSel: VCC_IO
        Required Capabilities: ANALOG
        Initial Value: 1
        IO Voltage: 0
    PORT MAP (
        pa_out => Flex8(0)__PA ,
        analog_term => Net_634 ,
        pad => Flex8(0)_PAD ,
        pin_input => __ONE__ );
    Properties:
    {
    }

Port 2 contains the following IO cells:
[IoId=2]: 
Pin : Name = Flex9(0)
    Attributes:
        In Group/Port: True
        In Sync Option: AUTO
        Out Sync Option: AUTO
        Interrupt generated: False
        Interrupt mode: NONE
        Drive mode: HI_Z_ANALOG
        VTrip: EITHER
        Slew: FAST
        Input Sync needed: False
        Output Sync needed: False
        SC shield enabled: False
        POR State: ANY
        LCD Mode: COMMON
        Register Mode: RegComb
        CaSense Mode: NEITHER
        Treat as pin: True
        Is OE Registered: False
        Uses Analog: True
        Can contain Digital: False
        Is SIO: False
        SIO Output Buf: NONREGULATED
        SIO Input Buf: SINGLE_ENDED
        SIO HiFreq: LOW
        SIO Hyst: DISABLED
        SIO Vtrip: MULTIPLIER_0_5
        SIO Multiplier Index: 0
        SIO RefSel: VCC_IO
        Required Capabilities: ANALOG
        Initial Value: 1
        IO Voltage: 0
    PORT MAP (
        pa_out => Flex9(0)__PA ,
        analog_term => Net_635 ,
        pad => Flex9(0)_PAD );
    Properties:
    {
    }

[IoId=3]: 
Pin : Name = Flex10(0)
    Attributes:
        In Group/Port: True
        In Sync Option: AUTO
        Out Sync Option: AUTO
        Interrupt generated: False
        Interrupt mode: NONE
        Drive mode: HI_Z_ANALOG
        VTrip: EITHER
        Slew: FAST
        Input Sync needed: False
        Output Sync needed: False
        SC shield enabled: False
        POR State: ANY
        LCD Mode: COMMON
        Register Mode: RegComb
        CaSense Mode: NEITHER
        Treat as pin: True
        Is OE Registered: False
        Uses Analog: True
        Can contain Digital: False
        Is SIO: False
        SIO Output Buf: NONREGULATED
        SIO Input Buf: SINGLE_ENDED
        SIO HiFreq: LOW
        SIO Hyst: DISABLED
        SIO Vtrip: MULTIPLIER_0_5
        SIO Multiplier Index: 0
        SIO RefSel: VCC_IO
        Required Capabilities: ANALOG
        Initial Value: 1
        IO Voltage: 0
    PORT MAP (
        pa_out => Flex10(0)__PA ,
        analog_term => Net_636 ,
        pad => Flex10(0)_PAD );
    Properties:
    {
    }

[IoId=4]: 
Pin : Name = Flex4(0)
    Attributes:
        In Group/Port: True
        In Sync Option: AUTO
        Out Sync Option: AUTO
        Interrupt generated: False
        Interrupt mode: NONE
        Drive mode: HI_Z_ANALOG
        VTrip: EITHER
        Slew: FAST
        Input Sync needed: False
        Output Sync needed: False
        SC shield enabled: False
        POR State: ANY
        LCD Mode: COMMON
        Register Mode: RegComb
        CaSense Mode: NEITHER
        Treat as pin: True
        Is OE Registered: False
        Uses Analog: True
        Can contain Digital: False
        Is SIO: False
        SIO Output Buf: NONREGULATED
        SIO Input Buf: SINGLE_ENDED
        SIO HiFreq: LOW
        SIO Hyst: DISABLED
        SIO Vtrip: MULTIPLIER_0_5
        SIO Multiplier Index: 0
        SIO RefSel: VCC_IO
        Required Capabilities: ANALOG
        Initial Value: 1
        IO Voltage: 0
    PORT MAP (
        pa_out => Flex4(0)__PA ,
        analog_term => Net_629 ,
        pad => Flex4(0)_PAD );
    Properties:
    {
    }

[IoId=5]: 
Pin : Name = Flex3(0)
    Attributes:
        In Group/Port: True
        In Sync Option: AUTO
        Out Sync Option: AUTO
        Interrupt generated: False
        Interrupt mode: NONE
        Drive mode: HI_Z_ANALOG
        VTrip: EITHER
        Slew: FAST
        Input Sync needed: False
        Output Sync needed: False
        SC shield enabled: False
        POR State: ANY
        LCD Mode: COMMON
        Register Mode: RegComb
        CaSense Mode: NEITHER
        Treat as pin: True
        Is OE Registered: False
        Uses Analog: True
        Can contain Digital: False
        Is SIO: False
        SIO Output Buf: NONREGULATED
        SIO Input Buf: SINGLE_ENDED
        SIO HiFreq: LOW
        SIO Hyst: DISABLED
        SIO Vtrip: MULTIPLIER_0_5
        SIO Multiplier Index: 0
        SIO RefSel: VCC_IO
        Required Capabilities: ANALOG
        Initial Value: 1
        IO Voltage: 0
    PORT MAP (
        pa_out => Flex3(0)__PA ,
        analog_term => Net_628 ,
        pad => Flex3(0)_PAD );
    Properties:
    {
    }

[IoId=6]: 
Pin : Name = Flex1(0)
    Attributes:
        In Group/Port: True
        In Sync Option: AUTO
        Out Sync Option: AUTO
        Interrupt generated: False
        Interrupt mode: NONE
        Drive mode: HI_Z_ANALOG
        VTrip: EITHER
        Slew: FAST
        Input Sync needed: False
        Output Sync needed: False
        SC shield enabled: False
        POR State: ANY
        LCD Mode: COMMON
        Register Mode: RegComb
        CaSense Mode: NEITHER
        Treat as pin: True
        Is OE Registered: False
        Uses Analog: True
        Can contain Digital: False
        Is SIO: False
        SIO Output Buf: NONREGULATED
        SIO Input Buf: SINGLE_ENDED
        SIO HiFreq: LOW
        SIO Hyst: DISABLED
        SIO Vtrip: MULTIPLIER_0_5
        SIO Multiplier Index: 0
        SIO RefSel: VCC_IO
        Required Capabilities: ANALOG
        Initial Value: 1
        IO Voltage: 0
    PORT MAP (
        pa_out => Flex1(0)__PA ,
        analog_term => Net_626 ,
        pad => Flex1(0)_PAD );
    Properties:
    {
    }

[IoId=7]: 
Pin : Name = Flex2(0)
    Attributes:
        In Group/Port: True
        In Sync Option: AUTO
        Out Sync Option: AUTO
        Interrupt generated: False
        Interrupt mode: NONE
        Drive mode: HI_Z_ANALOG
        VTrip: EITHER
        Slew: FAST
        Input Sync needed: False
        Output Sync needed: False
        SC shield enabled: False
        POR State: ANY
        LCD Mode: COMMON
        Register Mode: RegComb
        CaSense Mode: NEITHER
        Treat as pin: True
        Is OE Registered: False
        Uses Analog: True
        Can contain Digital: False
        Is SIO: False
        SIO Output Buf: NONREGULATED
        SIO Input Buf: SINGLE_ENDED
        SIO HiFreq: LOW
        SIO Hyst: DISABLED
        SIO Vtrip: MULTIPLIER_0_5
        SIO Multiplier Index: 0
        SIO RefSel: VCC_IO
        Required Capabilities: ANALOG
        Initial Value: 1
        IO Voltage: 0
    PORT MAP (
        pa_out => Flex2(0)__PA ,
        analog_term => Net_627 ,
        pad => Flex2(0)_PAD );
    Properties:
    {
    }

Port 3 contains the following IO cells:
[IoId=1]: 
Pin : Name = \UART:tx(0)\
    Attributes:
        In Group/Port: True
        In Sync Option: AUTO
        Out Sync Option: NOSYNC
        Interrupt generated: False
        Interrupt mode: NONE
        Drive mode: CMOS_OUT
        VTrip: EITHER
        Slew: FAST
        Input Sync needed: False
        Output Sync needed: False
        SC shield enabled: False
        POR State: ANY
        LCD Mode: COMMON
        Register Mode: RegComb
        CaSense Mode: NEITHER
        Treat as pin: True
        Is OE Registered: False
        Uses Analog: False
        Can contain Digital: True
        Is SIO: False
        SIO Output Buf: NONREGULATED
        SIO Input Buf: SINGLE_ENDED
        SIO HiFreq: LOW
        SIO Hyst: DISABLED
        SIO Vtrip: MULTIPLIER_0_5
        SIO Multiplier Index: 0
        SIO RefSel: VCC_IO
        Required Capabilities: DIGITAL
        Initial Value: 1
        IO Voltage: 0
    PORT MAP (
        pa_out => \UART:tx(0)\__PA ,
        pad => \UART:tx(0)_PAD\ );
    Properties:
    {
    }

Port 4 contains the following IO cells:
[IoId=0]: 
Pin : Name = \EZI2C_Flex:scl(0)\
    Attributes:
        In Group/Port: True
        In Sync Option: NOSYNC
        Out Sync Option: NOSYNC
        Interrupt generated: False
        Interrupt mode: NONE
        Drive mode: OPEN_DRAIN_LO
        VTrip: CMOS
        Slew: FAST
        Input Sync needed: False
        Output Sync needed: False
        SC shield enabled: False
        POR State: ANY
        LCD Mode: COMMON
        Register Mode: RegComb
        CaSense Mode: NEITHER
        Treat as pin: True
        Is OE Registered: False
        Uses Analog: False
        Can contain Digital: True
        Is SIO: False
        SIO Output Buf: NONREGULATED
        SIO Input Buf: SINGLE_ENDED
        SIO HiFreq: LOW
        SIO Hyst: DISABLED
        SIO Vtrip: MULTIPLIER_0_5
        SIO Multiplier Index: 0
        SIO RefSel: VCC_IO
        Required Capabilities: DIGITAL
        Initial Value: 1
        IO Voltage: 0
    PORT MAP (
        pa_out => \EZI2C_Flex:scl(0)\__PA ,
        fb => Net_622 ,
        pad => \EZI2C_Flex:scl(0)_PAD\ );
    Properties:
    {
    }

[IoId=1]: 
Pin : Name = \EZI2C_Flex:sda(0)\
    Attributes:
        In Group/Port: True
        In Sync Option: NOSYNC
        Out Sync Option: NOSYNC
        Interrupt generated: False
        Interrupt mode: NONE
        Drive mode: OPEN_DRAIN_LO
        VTrip: CMOS
        Slew: FAST
        Input Sync needed: False
        Output Sync needed: False
        SC shield enabled: False
        POR State: ANY
        LCD Mode: COMMON
        Register Mode: RegComb
        CaSense Mode: NEITHER
        Treat as pin: True
        Is OE Registered: False
        Uses Analog: False
        Can contain Digital: True
        Is SIO: False
        SIO Output Buf: NONREGULATED
        SIO Input Buf: SINGLE_ENDED
        SIO HiFreq: LOW
        SIO Hyst: DISABLED
        SIO Vtrip: MULTIPLIER_0_5
        SIO Multiplier Index: 0
        SIO RefSel: VCC_IO
        Required Capabilities: DIGITAL
        Initial Value: 1
        IO Voltage: 0
    PORT MAP (
        pa_out => \EZI2C_Flex:sda(0)\__PA ,
        fb => Net_623 ,
        pad => \EZI2C_Flex:sda(0)_PAD\ );
    Properties:
    {
    }

ARM group 0: empty
Clock group 0: 
    Clock Block @ F(Clock,0): 
    m0s8clockblockcell: Name =ClockBlock
        PORT MAP (
            hfclk => ClockBlock_HFClk ,
            imo => ClockBlock_IMO ,
            ext => ClockBlock_ExtClk ,
            sysclk => ClockBlock_SysClk ,
            ilo => ClockBlock_ILO ,
            lfclk => ClockBlock_LFClk ,
            dsi_in_0 => ClockBlock_Routed1 ,
            udb_div_0 => dclk_to_genclk ,
            ff_div_2 => \EZI2C_Flex:Net_847_ff2\ ,
            ff_div_7 => \ADC_Flex:Net_1845_ff7\ );
        Properties:
        {
        }
LCD group 0: empty
PICU group 0: empty
LPCOMP group 0: empty
SCB group 0: 
    SCB Block @ F(SCB,0): 
    m0s8scbcell: Name =\EZI2C_Flex:SCB\
        PORT MAP (
            clock => \EZI2C_Flex:Net_847_ff2\ ,
            interrupt => Net_606 ,
            uart_tx => \EZI2C_Flex:tx_wire\ ,
            uart_rts => \EZI2C_Flex:rts_wire\ ,
            mosi_m => \EZI2C_Flex:mosi_m_wire\ ,
            select_m_3 => \EZI2C_Flex:select_m_wire_3\ ,
            select_m_2 => \EZI2C_Flex:select_m_wire_2\ ,
            select_m_1 => \EZI2C_Flex:select_m_wire_1\ ,
            select_m_0 => \EZI2C_Flex:select_m_wire_0\ ,
            sclk_m => \EZI2C_Flex:sclk_m_wire\ ,
            miso_s => \EZI2C_Flex:miso_s_wire\ ,
            i2c_scl => Net_622 ,
            i2c_sda => Net_623 ,
            tr_tx_req => Net_624 ,
            tr_rx_req => Net_615 );
        Properties:
        {
            cy_registers = ""
            scb_mode = 0
        }
CSD group 0: empty
CSIDAC8 group 0: empty
CSIDAC7 group 0: empty
TCPWM group 0: empty
OA group 0: empty
TEMP group 0: empty
SARADC group 0: 
    SAR ADC @ F(SARADC,0): 
    p4sarcell: Name =\ADC_Flex:cy_psoc4_sar\
        PORT MAP (
            vplus => Net_598 ,
            vminus => \ADC_Flex:mux_bus_minus_0\ ,
            vref => \ADC_Flex:Net_3113\ ,
            ext_vref => \ADC_Flex:Net_3225\ ,
            clock => \ADC_Flex:Net_1845_ff7\ ,
            sample_done => Net_596 ,
            chan_id_valid => \ADC_Flex:Net_3108\ ,
            chan_id_3 => \ADC_Flex:Net_3109_3\ ,
            chan_id_2 => \ADC_Flex:Net_3109_2\ ,
            chan_id_1 => \ADC_Flex:Net_3109_1\ ,
            chan_id_0 => \ADC_Flex:Net_3109_0\ ,
            data_valid => \ADC_Flex:Net_3110\ ,
            data_11 => \ADC_Flex:Net_3111_11\ ,
            data_10 => \ADC_Flex:Net_3111_10\ ,
            data_9 => \ADC_Flex:Net_3111_9\ ,
            data_8 => \ADC_Flex:Net_3111_8\ ,
            data_7 => \ADC_Flex:Net_3111_7\ ,
            data_6 => \ADC_Flex:Net_3111_6\ ,
            data_5 => \ADC_Flex:Net_3111_5\ ,
            data_4 => \ADC_Flex:Net_3111_4\ ,
            data_3 => \ADC_Flex:Net_3111_3\ ,
            data_2 => \ADC_Flex:Net_3111_2\ ,
            data_1 => \ADC_Flex:Net_3111_1\ ,
            data_0 => \ADC_Flex:Net_3111_0\ ,
            eos_intr => Net_595 ,
            irq => \ADC_Flex:Net_3112\ );
        Properties:
        {
            cy_registers = ""
        }
CLK_GEN group 0: 
    M0S8 Clock Gen Block @ F(CLK_GEN,0): 
    m0s8clockgenblockcell: Name =ClockGenBlock
        PORT MAP (
            gen_clk_out_0 => Net_10_digital ,
            gen_clk_in_0 => dclk_to_genclk );
        Properties:
        {
        }
LPCOMPBLOCK group 0: empty
PASSBLOCK group 0: empty
WCO group 0: empty
SRSS group 0: empty
CPUSS group 0: empty
EXCO group 0: empty

Blocks not positioned by the digital component placer:
    Amux Block @ <No Location>: 
    amuxcell: Name =Flex_Mux
        PORT MAP (
            muxin_9 => Net_636 ,
            muxin_8 => Net_635 ,
            muxin_7 => Net_634 ,
            muxin_6 => Net_633 ,
            muxin_5 => Net_632 ,
            muxin_4 => Net_631 ,
            muxin_3 => Net_629 ,
            muxin_2 => Net_628 ,
            muxin_1 => Net_627 ,
            muxin_0 => Net_626 ,
            vout => Net_598 );
        Properties:
        {
            api_type = 0
            connect_mode = 1
            cy_registers = ""
            hw_control = 0
            init_mux_sel = "0000000000"
            muxin_width = 10
            one_active = 0
        }
</CYPRESSTAG>
<CYPRESSTAG name="Port Configuration Details">

------------------------------------------------------------
Port Configuration report
------------------------------------------------------------
     |     |       | Interrupt |                  |                     | 
Port | Pin | Fixed |      Type |       Drive Mode |                Name | Connections
-----+-----+-------+-----------+------------------+---------------------+-----------------------------
   0 |   0 |     * |      NONE |      HI_Z_ANALOG |            Flex5(0) | In(__ONE__), Analog(Net_631)
     |   1 |     * |      NONE |      HI_Z_ANALOG |            Flex7(0) | In(__ONE__), Analog(Net_633)
-----+-----+-------+-----------+------------------+---------------------+-----------------------------
   1 |   1 |     * |      NONE |      HI_Z_ANALOG |            Flex6(0) | In(__ONE__), Analog(Net_632)
     |   2 |     * |      NONE |      HI_Z_ANALOG |            Flex8(0) | In(__ONE__), Analog(Net_634)
-----+-----+-------+-----------+------------------+---------------------+-----------------------------
   2 |   2 |     * |      NONE |      HI_Z_ANALOG |            Flex9(0) | Analog(Net_635)
     |   3 |     * |      NONE |      HI_Z_ANALOG |           Flex10(0) | Analog(Net_636)
     |   4 |     * |      NONE |      HI_Z_ANALOG |            Flex4(0) | Analog(Net_629)
     |   5 |     * |      NONE |      HI_Z_ANALOG |            Flex3(0) | Analog(Net_628)
     |   6 |     * |      NONE |      HI_Z_ANALOG |            Flex1(0) | Analog(Net_626)
     |   7 |     * |      NONE |      HI_Z_ANALOG |            Flex2(0) | Analog(Net_627)
-----+-----+-------+-----------+------------------+---------------------+-----------------------------
   3 |   1 |     * |      NONE |         CMOS_OUT |        \UART:tx(0)\ | 
-----+-----+-------+-----------+------------------+---------------------+-----------------------------
   4 |   0 |     * |      NONE |    OPEN_DRAIN_LO | \EZI2C_Flex:scl(0)\ | FB(Net_622)
     |   1 |     * |      NONE |    OPEN_DRAIN_LO | \EZI2C_Flex:sda(0)\ | FB(Net_623)
------------------------------------------------------------------------------------------------------
</CYPRESSTAG>
</CYPRESSTAG>
</CYPRESSTAG>
Digital component placer commit/Report: Elapsed time ==> 0s.062ms
Digital Placement phase: Elapsed time ==> 1s.109ms
</CYPRESSTAG>
<CYPRESSTAG name="Digital Routing">
"C:\Program Files (x86)\Cypress\PSoC Creator\4.4\PSoC Creator\bin/sjrouter.exe" --xml-path "C:\Program Files (x86)\Cypress\PSoC Creator\4.4\PSoC Creator\dev\psoc4/psoc4a/route_arch-rrg.cydata" --vh2-path "Smart_gloves_uinsg_mux_r.vh2" --pcf-path "Smart_gloves_uinsg_mux.pco" --des-name "Smart_gloves_uinsg_mux" --dsf-path "Smart_gloves_uinsg_mux.dsf" --sdc-path "Smart_gloves_uinsg_mux.sdc" --lib-path "Smart_gloves_uinsg_mux_r.lib"
Routing successful.
Digital Routing phase: Elapsed time ==> 0s.812ms
</CYPRESSTAG>
<CYPRESSTAG name="Bitstream Generation">
Bitstream Generation phase: Elapsed time ==> 0s.203ms
</CYPRESSTAG>
<CYPRESSTAG name="Bitstream Verification">
Bitstream Verification phase: Elapsed time ==> 0s.031ms
</CYPRESSTAG>
<CYPRESSTAG name="Static timing analysis">
Timing report is in Smart_gloves_uinsg_mux_timing.html.
Static timing analysis phase: Elapsed time ==> 0s.281ms
</CYPRESSTAG>
<CYPRESSTAG name="Data reporting">
Data reporting phase: Elapsed time ==> 0s.000ms
</CYPRESSTAG>
<CYPRESSTAG name="Database update...">
Design database save phase: Elapsed time ==> 0s.234ms
</CYPRESSTAG>
cydsfit: Elapsed time ==> 3s.399ms
</CYPRESSTAG>
Fitter phase: Elapsed time ==> 3s.399ms
API generation phase: Elapsed time ==> 2s.359ms
Dependency generation phase: Elapsed time ==> 0s.015ms
Cleanup phase: Elapsed time ==> 0s.000ms
