{
  "driver_id": "1",
  "version": "1",
  "active": true,
  "dev_key": "f17f429303f8977d88c2df4e831fea88",
  "vendor": "METI M2M India Pvt Ltd",
  "meter": "QuickIoT_DI_OEM",
  "name": "QuickIoT_DI_OEM",
  "serial": {
    "baud": "4",
    "databits": "8",
    "parity": "0",
    "stopbits": "1"
  },
  "command": {
    "slaveId": "10",
    "function": "3",
    "startAddr": "2",
    "regCount": "1",
    "timeOut": "300",
    "retries": "3",
    "repeat_int": "3",
    "responseParser": {
      "sensor_100": {
        "id": "100",
        "nm": "OHT_Level",
        "un": "%",
        "rg": "2",
        "ra": "2",
        "dt": "10",
        "bo": "5",
        "sn": "1",
        "sd": "1",
        "dp": "0",
        "os": "0.000",
        "do": "99",
        "cv": "0.00",
        "ac": true,
        "di": true,
        "tx": true
      },
      "sensor_101": {
        "id": "101",
        "nm": "Pump1",
        "un": "On/Off",
        "rg": "2",
        "ra": "2",
        "dt": "10",
        "bo": "5",
        "sn": "1",
        "sd": "1",
        "dp": "0",
        "os": "0.000",
        "do": "99",
        "cv": "0.00",
        "ac": true,
        "di": true,
        "tx": true
      },
      "sensor_102": {
        "id": "102",
        "nm": "SUMP_Level",
        "un": "%",
        "rg": "2",
        "ra": "2",
        "dt": "10",
        "bo": "5",
        "sn": "1",
        "sd": "1",
        "dp": "0",
        "os": "0.000",
        "do": "99",
        "cv": "0.00",
        "ac": true,
        "di": true,
        "tx": true
      },
      "sensor_103": {
        "id": "103",
        "nm": "Pump2",
        "un": "On/Off",
        "rg": "2",
        "ra": "2",
        "dt": "10",
        "bo": "5",
        "sn": "1",
        "sd": "1",
        "dp": "0",
        "os": "0.000",
        "do": "99",
        "cv": "0.00",
        "ac": true,
        "di": true,
        "tx": true
      },
      "sensor_104": {
        "id": "104",
        "nm": "Val5",
        "un": "x",
        "rg": "2",
        "ra": "2",
        "dt": "10",
        "bo": "5",
        "sn": "1",
        "sd": "1",
        "dp": "0",
        "os": "0.000",
        "do": "99",
        "cv": "0.00",
        "ac": true,
        "di": false,
        "tx": true
      },
      "sensor_105": {
        "id": "105",
        "nm": "Val6",
        "un": "x",
        "rg": "2",
        "ra": "2",
        "dt": "10",
        "bo": "5",
        "sn": "1",
        "sd": "1",
        "dp": "0",
        "os": "0.000",
        "do": "99",
        "cv": "0.00",
        "ac": true,
        "di": false,
        "tx": true
      },
      "sensor_106": {
        "id": "106",
        "nm": "Val7f",
        "un": "x",
        "rg": "2",
        "ra": "2",
        "dt": "10",
        "bo": "5",
        "sn": "1",
        "sd": "1",
        "dp": "0",
        "os": "0.000",
        "do": "99",
        "cv": "0.00",
        "ac": true,
        "di": false,
        "tx": true
      }
    }
  }
}