{
	"pkt_ver": "1.1.0",
	"off_time": 5,
	"boot_wait": 120,
	"ping_interval": 60,
	"ping_retries": 5,
	"mqtt": {
		"enabled": false,
		"server": "mqtt.meti.in",
		"port": 1884,
		"ka": 120,
		"un": "quickiot",
		"pw": "12345678",
		"qos": 1,
		"t_pw": "topic_pw",
		"pi": 60
	}
}