<?xml version="1.0" encoding="utf-8"?>
<!-- Generator: Adobe Illustrator 21.0.0, SVG Export Plug-In . SVG Version: 6.00 Build 0)  -->
<svg version="1.1" id="Layer_1" xmlns="http://www.w3.org/2000/svg" xmlns:xlink="http://www.w3.org/1999/xlink" x="0px" y="0px"
	 viewBox="0 0 321.2 362.4" style="enable-background:new 0 0 321.2 362.4;" xml:space="preserve">
<style type="text/css">
	.st0{fill:#73292C;}
</style>
<g>
	<path class="st0" d="M284.8,203.3c-1.9-47.9-21.3-83.7-60-108.5c-6.6-4.2-10.6-9.6-10.2-17.6c0.6-14.2,15.6-22.1,28.1-14.6
		c22.6,13.4,40.7,31.6,54.5,54c58.1,94.8,5.4,218.4-103.1,242.2C114.9,376.1,34.4,329.9,8.2,252.1C-15.7,181.3,14,100.6,77.8,63
		c8.5-5,18.1-3.9,24.1,2.9c6,6.7,6.3,16.8,0.5,23.8c-1.8,2.1-4.2,3.8-6.5,5.3c-34,21.9-54.1,52.9-58.5,93
		c-7,64.8,35.7,120.1,93.9,133.9c68.6,16.2,134.3-25.2,150.2-94.1C283.6,219.1,284,210,284.8,203.3z"/>
	<path class="st0" d="M179,86c0,22,0,44,0,65.9c0,11.9-7.3,20.1-18,20.2c-11.1,0.1-18.8-7.9-18.8-20c0-44,0-87.9,0-131.9
		c0-12.1,7.6-20.3,18.6-20.3C171.6,0,179,8.3,179,20.5C179,42.3,179,64.1,179,86z"/>
</g>
</svg>
