<?xml version="1.0" encoding="utf-8"?>
<!-- Generator: Adobe Illustrator 21.0.0, SVG Export Plug-In . SVG Version: 6.00 Build 0)  -->
<svg version="1.1" id="Layer_1" xmlns="http://www.w3.org/2000/svg" xmlns:xlink="http://www.w3.org/1999/xlink" x="0px" y="0px"
	 viewBox="0 0 512 512.1" style="enable-background:new 0 0 512 512.1;" xml:space="preserve">
<style type="text/css">
	.st0{fill:#FFFFFF;}
</style>
<g>
	<path class="st0" d="M351.8,0.1c-7,7-13,13-19,19c-13.8,13.8-27.6,27.5-41.3,41.4c-2.5,2.6-5,3.6-8.7,3.6C212,64,141.2,64,70.3,64
		c-2,0-3.9,0-6.4,0c0,2.1,0,3.7,0,5.3c0,115,0,230,0,345c0,20.3,13.5,33.8,33.8,33.8c105.8,0,211.6,0,317.5,0
		c18.9,0,32.8-14,32.8-32.8c0-62,0-124-0.1-186c0-3.6,0.9-6.2,3.5-8.7c18.7-18.5,37.3-37.2,55.9-55.8c1.2-1.2,2-2.7,3-4.1
		c0.4,0.2,0.9,0.5,1.3,0.7c0.1,1.4,0.3,2.8,0.3,4.1c0,83.5,0.1,167,0,250.5c-0.1,53.3-42.6,95.9-95.9,96c-106.7,0.2-213.3,0.2-320,0
		c-53.3-0.1-95.9-42.8-96-96C0,299.2,0,182.4,0,65.5C0.1,33.8,20,8.6,50.6,1.6c4.5-1,9.2-1.5,13.9-1.5c94.3-0.1,188.6-0.1,283-0.1
		C348.4,0.1,349.3,0.1,351.8,0.1z"/>
	<path class="st0" d="M283.1,318.4c-30.2-30.1-60.1-60-90.3-90.2c0.9-1,2-2.2,3.1-3.4C268.3,152.6,340.6,80.2,413,7.9
		c2-2,4.2-3.9,6.6-5.3c7.3-4.3,14.5-3.3,20.5,2.7c22,21.9,43.9,43.8,65.8,65.7c6.7,6.7,7.1,15.9,1.2,23.4c-1.1,1.4-2.5,2.7-3.8,4
		c-72.2,72.2-144.4,144.4-216.6,216.7C285.3,316.3,284,317.6,283.1,318.4z"/>
	<path class="st0" d="M166.7,249.4c31.9,31.9,63.4,63.3,95.2,95.2c-42.1,10.5-84.2,21-127,31.7C145.7,333.5,156.2,291.5,166.7,249.4
		z"/>
</g>
</svg>
