{
    "services": [
        {
            "status": "Normal",
            "applicationName": "SafetyConnect",
            "comment": null,
            "cannedMessages": [],
            "maintenanceInfo": "Scheduled maintenance on March 14.",
            "allComments": null
        },
        {
            "status": "Unavailable",
            "applicationName": "DestinationAssist",
            "comment": null,
            "cannedMessages": [
                {
                    "id": 5,
                    "message": "Destination Assist temporarily unavailable",
                    "selected": true
                }
            ],
            "maintenanceInfo": null,
            "allComments": "Destination Assist temporarily unavailable"
        },
        {
            "status": "Limited",
            "applicationName": "ServiceConnect",
            "comment": "sadfasdf",
            "cannedMessages": [
                {
                    "id": 6,
                    "message": "Health Reports unavailable",
                    "selected": true
                }
            ],
            "maintenanceInfo": null,
            "allComments": "Health Reports unavailable"
        }
    ],
    "apps": [
        {
            "status": "Limited",
            "applicationName": "RemoteServices",
            "comment": null,
            "cannedMessages": [
                {
                    "id": 10,
                    "message": "Service Interruption - We are currently experiencing technical difficulties with Remote Commands/Login/All Features/Account Registration.  We are working on resolving this problem as quickly as possible and apologize for any inconvenience this may cause.",
                    "selected": true
                }
            ],
            "maintenanceInfo": null,
            "allComments": "Service Interruption - We are currently experiencing technical difficulties with Remote Commands/Login/All Features/Account Registration.  We are working on resolving this problem as quickly as possible and apologize for any inconvenience this may cause."
        },
        {
            "status": "Limited",
            "applicationName": "ScoutGPSLink",
            "comment": null,
            "cannedMessages": [],
            "maintenanceInfo": "a quick brown fox jumped over the lazy dogs.  Pack my bag with five dozen jugs of gatorade.",
            "allComments": ""
        },
        {
            "status": "Limited",
            "applicationName": "AppSuite",
            "comment": "asdfasdfsadf",
            "cannedMessages": [
                {
                    "id": 15,
                    "message": "Pandora experiencing issues",
                    "selected": true
                },
                {
                    "id": 17,
                    "message": "Slacker experiencing issues",
                    "selected": true
                }
            ],
            "maintenanceInfo": "Upcoming maintenance at  XXXXXXX.",
            "allComments": "Pandora experiencing issues\nSlacker experiencing issues"
        }
    ],
    "websites": [
        {
            "status": "Normal",
            "applicationName": "LexusDrivers",
            "comment": "asdfd",
            "cannedMessages": [
                {
                    "id": 20,
                    "message": "Site available",
                    "selected": true
                }
            ],
            "maintenanceInfo": "",
            "allComments": "Site available"
        },
        {
            "status": "Normal",
            "applicationName": "ToyotaOwner",
            "comment": "there is asdfsadfsadf",
            "cannedMessages": [],
            "maintenanceInfo": "",
            "allComments": ""
        },
        {
            "status": "Normal",
            "applicationName": "RegistrationCustomer",
            "comment": null,
            "cannedMessages": [],
            "maintenanceInfo": null,
            "allComments": ""
        },
        {
            "status": "Normal",
            "applicationName": "RegistrationDealer",
            "comment": "",
            "cannedMessages": [
                {
                    "id": 20,
                    "message": "Site available",
                    "selected": true
                }
            ],
            "maintenanceInfo": "",
            "allComments": "Site available"
        }
    ],
    "currentDate": 1520892898731
}