{
  "project_info": {
    "project_number": "471783493787",
    "project_id": "kolica-e0398",
    "storage_bucket": "kolica-e0398.appspot.com"
  },
  "client": [
    {
      "client_info": {
        "mobilesdk_app_id": "1:471783493787:android:5d6fac9e935850e896763e",
        "android_client_info": {
          "package_name": "com.centroid.flutter_app_ecommerce"
        }
      },
      "oauth_client": [
        {
          "client_id": "471783493787-bee5vem3n0798nt5jrpq248cttv63q7k.apps.googleusercontent.com",
          "client_type": 3
        }
      ],
      "api_key": [
        {
          "current_key": "AIzaSyBckLgt-Za4_0jByvmLJOBa2AJx_sZ2BLM"
        }
      ],
      "services": {
        "appinvite_service": {
          "other_platform_oauth_client": [
            {
              "client_id": "471783493787-bee5vem3n0798nt5jrpq248cttv63q7k.apps.googleusercontent.com",
              "client_type": 3
            }
          ]
        }
      }
    }
  ],
  "configuration_version": "1"
}