// Jest Snapshot v1, https://goo.gl/fbAQLP

exports[`matches snapshot 1`] = `
Array [
  <div
    className="MuiBox-root css-0"
    data-testid="about-cards"
  >
    <h3
      className="MuiTypography-root MuiTypography-h3 css-1oii8qp-MuiTypography-root"
    >
      Meet our Team!
    </h3>
    <h5
      className="MuiTypography-root MuiTypography-h5 css-11lhw42-MuiTypography-root"
    >
      Our project aims at providing assistance to the undocumented immigrants near the Texas border. We aim to present information about where these immigrant communities are located, employment assistance and skill development for immigrants, and crucial legal resources as well.
    </h5>
    <div
      className="MuiBox-root css-1ruxp1v"
    >
      <b>
         
        Explanation of the interesting result of integrating disparate data:
         
      </b>
       
      The Integration between the various Communities, Employment Aid Resources and Legal Aid Resources allows for an integrated information application where those that need to can find all the information they need in one place. One interesting finding from combining different datasets is that when data points are close to each other in location, they tend to have similar links. This means that nearby data points often share common connections, making the integrated platform more connected in those areas.
    </div>
    <span
      className="MuiTypography-root MuiTypography-h7 css-1tyunu9-MuiTypography-root"
    />
    <br />
    <div
      className="MuiBox-root css-xi606m"
    >
      <a
        className="MuiTypography-root MuiTypography-inherit MuiLink-root MuiLink-underlineAlways css-1xylxj1-MuiTypography-root-MuiLink-root"
        href="https://documenter.getpostman.com/view/30034938/2s9YJZ3jae"
        onBlur={[Function]}
        onFocus={[Function]}
      >
        API Docs
      </a>
      <br />
      <a
        className="MuiTypography-root MuiTypography-inherit MuiLink-root MuiLink-underlineAlways css-1xylxj1-MuiTypography-root-MuiLink-root"
        href="https://gitlab.com/varre.abhinav/undocumented-texas-immigrants"
        onBlur={[Function]}
        onFocus={[Function]}
      >
        Our Repo
      </a>
    </div>
  </div>,
  <h1>
    Loading...
  </h1>,
]
`;
