{
    "dev": {
        "app_function": "flask_api.app",
        "aws_region": "us-west-2",
        "profile_name": "default",
        "project_name": "backend",
        "runtime": "python3.11",
        "s3_bucket": "flaskzappadeployment"
    }
}